{"text_format":"1","workbook":"xlsx","n_sheets":5,"sheets":["Istruzioni","Input tabelle","Criticità & Indicatori","Alternative & Selezioni","Cronoprogramma 2016-2019"],"not_rendered":{"charts":0,"images":1,"macros":1,"external_links":0,"defined_names":5,"comments":0,"pivot_tables":0},"unopened":[],"bounds":{"document_bytes":16777216,"sheet_cells":100000,"rows_first":2000,"rows_last":500,"rows_between":2000,"halvings":0,"cell_chars":16384,"cell_head_chars":4096},"cells_cut":0,"cells_raw":0,"read":"whole","date_system":"1900"}

{"sheet":"Istruzioni","index":0,"n_rows":65,"n_cols":4,"rows_kept":65,"cut":false,"hidden":false,"merged":[[34,2,34,3],[48,2,48,3],[8,2,8,3],[13,2,13,3],[20,2,20,3],[29,2,30,2],[29,3,30,3]]}
[]
[null,null,"Istruzioni per la compilazione  della Mappa criticità-interventi"]
[null,null,"La “Mappa criticità-interventi” (di seguito Mappa) è costituita da cinque fogli di  calcolo, di cui solo tre sono compilabili dall’utente (evidenziati dalla linguetta della scheda di colore  blu)."]
[null,null,"·         Foglio “Istruzioni”"]
[null,null,"·         Foglio “Input tabelle”"]
[null,null,"·         Foglio “Criticità & Indicatori” (compilabile)"]
[null,null,"·         Foglio “Alternative & Selezioni” (compilabile)"]
[null,null,"·         Foglio “Cronoprogramma 2016-2019” (compilabile)"]
[null,null,"Il colore della cella ad intestazione di ciascuna tabella indica se il dato si riferisce alla precedente programmazione 2014-2017 o alla nuova programmazione 2016-2019"]
[null,null,null,"Dati PdI 2016-2019"]
[null,null,null,"Dati PdI 2014-2017"]
[]
[null,null,"1. Intestazione dei fogli di calcolo"]
[null,null," In ciascun foglio della Mappa, in testa alle tabelle, è presente una sezione di informazioni generali dove si chiede l' indicazione di ATO, Ente di Governo d’Ambito e Soggetto Gestore per il quale è stata fatta la predisposizione tariffaria, con i rispettivi codici identificativi (ID) assegnati in sede di registrazione nell’anagrafica dell’AEEGSI. Compilando questa sezione nel primo foglio della Mappa (Criticità & Indicatori), le medesime informazioni verranno automaticamente aggiornate negli altri due fogli compilabili. "]
[]
[]
[]
[]
[]
[null,null,"2. Voci foglio di calcolo \"Criticità & Indicatori\""]
[null,null,"Questo foglio di calcolo è organizzato in modo tale da raccogliere le informazioni più puntuali richieste ai Capitoli 2 e 3 dello schema tipo di cui all'Allegato A alla determina 2/2016/DSID. Ciascuna riga compilabile della tabella corrisponde ad una criticità individuata dall'EGA (è stato previsto un numero di righe sufficiente a raccogliere eventualmente tutte le criticità possibili). Per criticità ancora sussistenti ripetto alla precedente pianificazione (2014-2017), sono previsti appositi riferimenti (es. \"Criticità AEEGSI ex-determina 3/2014/DSID\" e \"Valori obiettivo PdI 2014-2017\").  "]
[null,null,"Di seguito alcune informazioni più puntuali su specifiche voci del foglio "]
[]
[null,null,"Criticità AEEGSI e sotto-area criticità 2016-2019 ex determina 2/2016/DSID","Inserire il codice delle criticità specifiche e delle sotto-aree corrispondenti utilizzando esclusivamente il menù a tendina predisposto"]
[null,null,"Criticità AEEGSI ex determina 3/2014/DSID","Inserire il codice delle criticità utilizzando esclusivamente il menù a tendina predisposto"]
[null,null,"Località interessata/e criticità","Indicare i confini amministrativi ( es. Comune/i, Provincia/e, ATO) o geografici (es. valle, pianura, bacino)"]
[null,null,"Popolazione interessata criticità (ab.)","Coerentemente alla località interessata dalla criticità, dare evidenza del numero di abitanti interessati (effettivamente rilevati o stimati o eventualmente facendo riferimento ai dati Istat)."]
[null,null,"rilevata/stimata","Nella valutazione della popolazione interessata dalla criticità, si distingue se il dato è rilevato o stimato "]
[null,null,"Indicatore di performance utilizzato","Nome dell'indicatore o breve descrizione (es. \"Stato degli impianti\")"]
[null,null,"Formula [Unità di misura]","Es. \"popolazione servita/popolazione totale (%)\""]
[]
[null,null,"Grado di attendibilità indicatore","La valutazione del grado di attendibilità segue l'omonima classificazione per codice numerico contenuta nello Schema-tipo. Il valore 1 raccoglie tutti gli indicatori costituiti da grandezze effettivamente rilevate, il valore 2 raccoglie gli indicatori \"ibridi\" (costruiti a partire da grandezze in parte stimate o riprese dalla letteratura tecnica-scientifica), mentre il valore 3 riguarda gli indicatori costituiti da sole grandezze stimate."]
[]
[null,null,"3. Voci foglio di calcolo \"Alternative & Selezione\""]
[null,null,"In questo foglio di calcolo sono raccolte le informazioni contenute nel Capitolo 4 dello Schema-tipo (\"Strategie di intervento ed analisi delle opzioni progettuali\"). Come per il foglio precedente, anche in questa tabella ciascuna riga rappresenta la criticità individuata (eventualmente replicata più volte in caso siano selezionati più interventi per risolverla), per la quale è stata condotta l'analisi delle opzioni alternative. In via previsionale, sono state inserite fino a un massimo di 10 opzioni progettuali alternative percorribili. [Nota: può accadere sia che per piu' criticita' venga selezionato il medesimo intervento, sia che per la stessa criticita' vengano selezionati piu' interventi riportati su più righe]"]
[null,null,"Di seguito alcune informazioni più puntuali su specifiche voci del foglio "]
[]
[null,null,"ID Intervento pianificato","Indicare un numero progressivo (1,2,3,..) che permetta di identificare univocamente ciascun singolo intervento soggetto ad analisi delle opzioni alternative."]
[null,null,"Titolo intervento","Si richiede un’indicazione sintetica, eventualmente anche mediante l’utilizzo di parole chiave (es. realizzazione nuovo potabilizzatore, efficientamento impianto sollevamento etc.)."]
[null,null,"Costo totale intervento","Si chiede di indicare il costo totale dell'intervento previsto per il quadriennio 2016-2019. "]
[null,null,"Popolazione interessata intervento (ab)","Dare evidenza del numero di abitanti interessati dall'intervento (effettivamente rilevati, stimati o eventualmente facendo riferimento ai dati Istat). In coerenza con la voce \"Popolazione interessata dalla criticità\", tale valore non può essere maggiore di quest'ultimo."]
[null,null,"Livello obiettivo finale","Si intende il livello obiettivo che si prevede raggiungere a conclusione dell'intervento pianificato."]
[null,null,"Opzione 0","Definire in questa voce (se considerata) solo la situazione in assenza di realizzazione dell'intervento."]
[null,null,"Costo previsto opzione 0","La misura del costo dell'Opzione 0 ad esempio può essere espressa in termini di costo potenziale (es. costo della multa) o in termini di costo per manutenzioni straordinarie."]
[null,null,"Opzione n","Come per la voce dell'intervento pianificato, si richiede un'indicazione sintetica o per parole chiave delle opzioni progettuali alternative. Con riferimento al costo, alla popolazione interessata, al livello obiettivo, vedere le medesime voci specificate per l'intervento."]
[]
[]
[null,null,"4. Voci foglio di calcolo \"Cronoprogramma 2016-2019\""]
[null,null,"Questo foglio rappresenta la sintesi della fase conclusiva del procedimento di pianificazione degli interventi per il quadriennio 2016-2019, la cui descrizione è contenuta nel Capitolo 5 dello Schema-tipo. Il foglio dà altresì evidenza degli eventuali scostamenti di cui al Capitolo 6 (sia con riferimento agli investimenti realizzati negli anni 2014-2015 che programmati negli anni 2016-2017). Rispetto ai fogli precedenti, la logica di allocazione delle criticità e dei costi nel Cronoprogramma 2016-2019 avviene per singolo intervento. La tabella contiene 250 righe, ma viene concessa  la possibilità di aggiungere o eliminare righe tramite appositi pulsanti (non è possibile aggiungere righe manualmente). [Nota: nel caso in cui un intervento risolva più criticità, occorre replicarlo su più righe in numero corrispondente alle criticità risolte]"]
[null,null,"Di seguito alcune informazioni più puntuali su specifiche voci del foglio "]
[]
[null,null,"ID Intervento pianificato","Indicare un numero progressivo (1,2,3,..) che permetta di identificare univocamente ciascun singolo intervento soggetto ad analisi delle opzioni alternative, in coerenza con la rispettiva voce del foglio \"Alternative & Selezioni\". Nel caso in cui nel Cronoprogramma si sia reso necessario scorporare l'intervento in n sotto-interventi (ad esempio a livello territoriale), in ragione della differente entrata in esercizio, l'ID di riferimento dovrà essere scomposto in maniera coerente (es. 1.1, 1.2, 1.3,.., 1.n). "]
[null,null,"Titolo intervento","Deve coincidere con quella indicata nel foglio \"Alternative & Selezioni\"."]
[null,null,"Intervento presente nel PdI 2014-2017?","Indicare se l'intervento riportato era già stato programmato nel precedente PdI 2014-2017; la scelta è limitata da un apposito menù a tendina. "]
[null,null,"Popolazione interessata criticità (ab)","Deve coincidere con l'omonimo valore indicato nel foglio \"Criticità & Indicatori\"."]
[null,null,"Rilevata/stimata","Segue lo stesso sistema di valutazione del \"Grado di affidabilità popolazione criticità\" contenuto nel foglio \"Criticità & Indicatori\"."]
[null,null,"Località interessata/e criticità","Indicare i confini amministrativi ( es. Comune/i, Provincia/e, ATO) o geografici (es. valle, pianura, bacino) su cui impatta l'intervento selezionato. Non deve/devono essere più estesa/e dell'area che subisce la criticità."]
[null,null,"Iter autorizzativo concluso?","Fa riferimento all’eventuale necessità di permessi, nulla osta, altre eventuali autorizzazioni. Nel caso l’intervento non necessiti di alcuna autorizzazione, selezionare la voce N.A. (non applicabile)."]
[null,null,"Stadio di progettazione/esecuzione","Indica il livello di maturità degli interventi pianificati; la scelta è  limitata da un apposito menù a tendina."]
[null,null,"Livello obiettivo PdI 2014-2017 ","Tale valore si riferisce agli anni 2016 e 2017; se non si dispone del valore disaggregato per i due anni di pianificazione compilare solo la cella relativa all'anno cui fa riferimento il valore obiettivo finale dell'indicatore. "]
[null,null,"Livello obiettivo PdI 2016-2019 ","Se non si dispone del valore disaggregato per i quattro anni di pianificazione compilare solo la cella relativa all'anno cui fa riferimento il valore obiettivo finale dell'indicatore. "]
[null,null,"Post-2019","Questa voce si applica nell'eventualità in cui la risoluzione della criticità sia prevista in un anno successivo al 2019, così come il raggiungimento del valore obiettivo. In questo caso si richiede anche di indicare l'anno di raggiungimento di tale valore (la cella \"Anno?\" è compilabile)."]
[null,null,"Investimento realizzato","Tale voce fa riferimento alla realizzazione degli interventi la cui spesa nel precedente ciclo di pianificazione (2014-2017) era stata imputata nel solo biennio 2014-2015, in coerenza con l'art. 11 dell'Allegato A alla delibera 664/2015/R/IDR."]
[null,null,"Investimento pianificato PdI 2014-2017","Tale voce fa riferimento agli investimenti che nel precedente PdI erano stati pianificati negli anni 2016 e 2017, che si sovrappongono con i primi due anni del nuovo ciclo di pianificazione. "]
[null,null,"Investimento pianificato PdI 2016-2019","E’ possibile imputare solo l’importo per le singole annualità. Il foglio elabora automaticamente la somma sia per la quota finanziata con tariffa sia per la quota finanziata con contributo pubblico."]

{"sheet":"Input tabelle","index":1,"n_rows":142,"n_cols":9,"rows_kept":142,"cut":false,"hidden":false,"merged":[[34,8,35,8],[3,8,4,8],[1,2,1,8],[9,8,10,8],[16,8,17,8],[23,8,24,8]]}
[]
[null,null,"Input fogli di calcolo"]
[]
[null,null,"Criticità AEEGSI ex determina 2/2016/DSID",null,"Sotto-area 2016-2019 ex determina 2/2016/DSID",null,"Criticità AEEGSI  ex determina 3/2014/DSID",null,"Grado di affidabilità popolazione"]
[null,null,"K1.1"]
[null,null,"K1.1",null,"K1",null,"A1",null,"rilevata"]
[null,null,"K2.1",null,"K2",null,"A2",null,"stimata"]
[null,null,"K3.1",null,"K3",null,"A3"]
[null,null,"K4.1",null,"K4",null,"A4"]
[null,null,"K5.1",null,"K5",null,"A5",null,"Grado di affidabilità indicatore "]
[null,null,"A1.1",null,"A1",null,"B1"]
[null,null,"A1.2",null,"A2",null,"B2",null,1]
[null,null,"A1.3",null,"A3",null,"B3",null,2]
[null,null,"A1.4",null,"A4",null,"B4",null,3]
[null,null,"A2.1",null,"A5",null,"B5"]
[null,null,"A2.2",null,"A6",null,"B6"]
[null,null,"A3.1",null,"A7",null,"B7",null,"Iter autorizzativo concluso?"]
[null,null,"A3.2",null,"A8",null,"B8"]
[null,null,"A4.1",null,"A9",null,"C1",null,"SI"]
[null,null,"A4.2",null,"A10",null,"C2",null,"NO"]
[null,null,"A4.3",null,"P1",null,"C3",null,"N.A."]
[null,null,"A5.1",null,"P2",null,"C4"]
[null,null,"A5.2",null,"P3",null,"C5"]
[null,null,"A5.3",null,"P4",null,"D1",null,"Stadio di progettazione/esecuzione"]
[null,null,"A6.1",null,"P5",null,"D2"]
[null,null,"A7.1",null,"P6",null,"D3",null,"Scheda progetto"]
[null,null,"A7.2",null,"P7",null,"D4",null,"Studio di fattibilità"]
[null,null,"A7.3",null,"B1",null,"E1",null,"Progetto preliminare"]
[null,null,"A7.4",null,"B2",null,"E2",null,"Progetto definitivo"]
[null,null,"A7.5",null,"B3",null,"E3",null,"Progetto esecutivo"]
[null,null,"A8.1",null,"B4",null,"E4",null,"Lavori aggiudicati"]
[null,null,"A8.2",null,"B5",null,"E5",null,"Lavori in corso"]
[null,null,"A9.1",null,"B6",null,"F1"]
[null,null,"A9.2",null,"B7",null,"F2"]
[null,null,"A10",null,"B8",null,"F3",null,"Intervento presente nel PdI 2014-2017?"]
[null,null,"P1.1",null,"B9",null,"F4"]
[null,null,"P1.2",null,"B10",null,"F5",null,"Sì"]
[null,null,"P1.3",null,"B11",null,"F6",null,"No"]
[null,null,"P1.4",null,"C1",null,"F7"]
[null,null,"P1.5",null,"C2",null,"F8"]
[null,null,"P1.6",null,"C3",null,"G1"]
[null,null,"P1.7",null,"C4",null,"G2"]
[null,null,"P1.8",null,"C5",null,"G3"]
[null,null,"P2.1",null,"C6",null,"G4"]
[null,null,"P2.2",null,"C7",null,"G5"]
[null,null,"P2.3",null,"C8"]
[null,null,"P3.1",null,"D1"]
[null,null,"P3.2",null,"D2"]
[null,null,"P4.1",null,"D3"]
[null,null,"P4.2",null,"D4"]
[null,null,"P4.3",null,"D5"]
[null,null,"P5.1",null,"D6"]
[null,null,"P5.2",null,"G1"]
[null,null,"P6.1",null,"G2"]
[null,null,"P6.2",null,"G3"]
[null,null,"P7.1",null,"G4"]
[null,null,"B1.1",null,"G5"]
[null,null,"B1.2",null,"M1"]
[null,null,"B1.3",null,"M2"]
[null,null,"B1.4",null,"M3"]
[null,null,"B1.5",null,"M4"]
[null,null,"B2.1",null,"M5"]
[null,null,"B3.1"]
[null,null,"B4.1"]
[null,null,"B4.2"]
[null,null,"B5.1"]
[null,null,"B6.1"]
[null,null,"B6.2"]
[null,null,"B6.3"]
[null,null,"B7.1"]
[null,null,"B8.1"]
[null,null,"B9.1"]
[null,null,"B9.2"]
[null,null,"B10.1"]
[null,null,"B10.2"]
[null,null,"B11.1"]
[null,null,"C1.1"]
[null,null,"C2.1"]
[null,null,"C2.2"]
[null,null,"C2.3"]
[null,null,"C2.4"]
[null,null,"C2.5"]
[null,null,"C2.6"]
[null,null,"C2.7"]
[null,null,"C2.8"]
[null,null,"C2.9"]
[null,null,"C3.1"]
[null,null,"C4.1"]
[null,null,"C4.2"]
[null,null,"C5.1"]
[null,null,"C6.1"]
[null,null,"C6.2"]
[null,null,"C7.1"]
[null,null,"C7.2"]
[null,null,"C8.1"]
[null,null,"D1.1"]
[null,null,"D1.2"]
[null,null,"D1.3"]
[null,null,"D1.4"]
[null,null,"D1.5"]
[null,null,"D2.1"]
[null,null,"D2.2"]
[null,null,"D2.3"]
[null,null,"D2.4"]
[null,null,"D2.5"]
[null,null,"D2.6"]
[null,null,"D2.7"]
[null,null,"D2.8"]
[null,null,"D2.9"]
[null,null,"D2.10"]
[null,null,"D3.1"]
[null,null,"D3.2"]
[null,null,"D4.1"]
[null,null,"D4.2"]
[null,null,"D4.3"]
[null,null,"D4.4"]
[null,null,"D5.1"]
[null,null,"D5.2"]
[null,null,"D6.1"]
[null,null,"D6.2"]
[null,null,"D6.3"]
[null,null,"G1.1"]
[null,null,"G2.1"]
[null,null,"G3.1"]
[null,null,"G4.1"]
[null,null,"G5.1"]
[null,null,"M1.1"]
[null,null,"M1.2"]
[null,null,"M1.3"]
[null,null,"M1.4"]
[null,null,"M1.5"]
[null,null,"M2.1"]
[null,null,"M3.1"]
[null,null,"M4.1"]
[null,null,"M4.2"]
[null,null,"M4.3"]
[null,null,"M4.4"]
[null,null,"M4.5"]
[null,null,"M4.6"]
[null,null,"M4.7"]
[null,null,"M4.8"]
[null,null,"M5.1"]

{"sheet":"Criticità & Indicatori","index":2,"n_rows":35,"n_cols":13,"rows_kept":35,"cut":false,"hidden":false,"merged":[[5,12,6,12],[5,10,6,10],[5,7,6,7],[5,11,6,11],[5,9,6,9],[5,8,6,8],[5,1,6,1],[5,5,6,5],[5,4,6,4],[5,3,6,3],[5,6,6,6],[5,2,6,2]]}
[]
[null,"ATO","ATO CO - COMO","ID ATO",304,null,null,"Dati PdI 2016-2019"]
[null,"Ente di Governo d'Ambito","Provincia di Como","ID Ente di Governo d'Ambito"]
[null,"Soggetto Gestore","Como Acqua srl","ID Soggetto Gestore",21521,null,null,"Dati PdI 2014-2017"]
[]
[null,"Criticità AEEGSI ex determina 2/2016/DSID","Sotto-area 2016-2019 ex determina 2/2016/DSID","Criticità AEEGSI  ex determina 3/2014/DSID","Località interessata/e criticità","Popolazione interessata criticità PdI 2016-2019 (ab.)","Rilevata/ Stimata","Incidenza su pop. Totale ATO (%)","Indicatore di performance utilizzato","Formula \n[Unità di misura]","Grado di attendibilità indicatore","Livello attuale al 31-12-2015","Livello obiettivo PdI (2014-2017)"]
[]
[null,"K1.1","K1","B4","136 Comuni",508066,"rilevata",85,"Percentuale di digitalizzazione delle infrastrutture acquedottistiche","Numero di Comuni con infrastrutture acquedottistiche completamente digitalizzate / Comuni presenti nell'ATO [%]",1,11.1,"-"]
[null,"K1.1","K1","C5","137 Comuni",476635,"rilevata",80,"Percentuale di digitalizzazione delle infrastrutture fognarie","Numero di Comuni con infrastrutture fognarie completamente digitalizzate / Comuni presenti nell'ATO [%]",1,10.5,"-"]
[null,"K3.1","K3","A1","dato non disponibile",null,null,null,"Percentuale delle reti acquedottistiche dotate di sistema di telecontrollo/teleallarme","Reti acquedottistiche dotate di sistema di telecontrollo-teleallarme / Numero reti acquedottistiche presenti nell'ATO [%]",1,"non disponibile","-"]
[null,"K3.1","K3","A1","Depuratori presenti nell'ATO",null,null,null,"Percentuale degli impianti di depurazione dotati di sistema di telecontrollo / teleallarme","Depuratori con dotati di sistema di telecontrollo-teleallarme / Depuratori presenti nell'ATO [%]",1,"non disponibile","-"]
[null,"A1.1","A1","A1","ATO Como",null,null,null,"Episodi di interruzione della fornitura dovuta a problemi di approvvigionamento idrico","Numero di episodi all'anno con presenza di interruzione del servizio superiore a 24 ore, documentati dal Gestore e/o dai Comuni, dovuti a problemi di approvvigionamento idrico [num./anno]",1,"non disponibile","-"]
[null,"A1.4","A1","A5","ATO Como",549901,"stimata",92,"Percentuale del numero di captazioni ricadenti nell'ATO con aree di salvaguardia aventi la necessità di essere ridelimitate","Numero di captazioni con necessità di ridelimitazione dell'area di salvaguardia / Numero di captazioni presenti nell'ATO [%]",1,41.4,"-"]
[null,"P2.1","P2","B2","34 Comuni (per la maggior parte nella parte settentrionale dell'ATO)",60449,"stimata",10.1,"Giudizio sintetico complessivo dello stato di qualità dell’acqua distribuita dall'acquedotto pubblico - Parametri microbiologici","Indicazione di un giudizio annuale (BUONO, DISCRETO, CRITICO, MOLTO CRITICO), espresso sulla base delle indicazioni dell'ATS (ex ASL), per ogni rete acquedottistica comunale e in base ai parametri microbiologici, al fine di aggregare il dato e calcolare un valore medio a livello comunale a partire dai dati dei singoli controlli [Giudizio annuale]",1,"Discreto/Buono: per 119 Comuni;\nCritico / Molto Critico: per 34 Comuni","100% giudizi almeno DISCRETO"]
[null,"P2.1","P2","B2","Griante",633,"stimata",0.1,"Giudizio sintetico complessivo dello stato di qualità dell’acqua distribuita dall'acquedotto pubblico - Parametri chimici","Indicazione di un giudizio annuale (BUONO, DISCRETO, CRITICO, MOLTO CRITICO), espresso sulla base delle indicazioni dell'ATS (ex ASL), per ogni rete acquedottistica comunale e in base ai parametri chimici, al fine di aggregare il dato e calcolare un valore medio a livello comunale a partire dai dati dei singoli controlli [Giudizio annuale]",1,"Discreto/Buono: per 147 Comuni;\nCritico / Molto Critico: per 1 Comune (Griante)\nNon Disponibile: per 5 Comuni","100% giudizi almeno DISCRETO"]
[null,"B4.1","B4","B4","ATO Como",127812,"stimata",21.4,"Lunghezza della rete acquedottistica (adduzione e distribuzione) da ristrutturare","A seguito dell'esecuzione degli interventi di rifacimento delle reti acquedottistiche, si aggiorna il dato dei \"km di rete da sostituire\" inzialmente elaborato col software EPANET (usato per determinare la lunghezza dei tratti di rete da assoggettare a manutenzione e quindi per pianificare gli investimenti). Il valore potrà essere continuamente aggiornato a seguito di ricognizioni/segnalazioni da parte del Gestore [km]",3,1006.46,"-"]
[null,"B7.1","B7","A1",null,null,null,null,"Percentuale delle opere di estensione delle reti di distribuzione e adduzione realizzate rispetto a quelle previste.","Numero di interventi di estensione delle reti acquedottistiche realizzati / Numero di interventi di estensione delle reti acquedottistiche previsti [%]",1,"non disponibile",0]
[null,"B8.1","B8","A4","ATO Como",565404,"stimata",94.6,"Percentuale delle opere di adeguamento e/o costruzione di serbatoi realizzate rispetto a quelle previste.","Numero di interventi di adeguamento e/o costruzione di serbatoi realizzati / Numero di interventi di adeguamento e/o costruzione di serbatoi previsti [%]",1,"non disponibile",0]
[null,"C1.1","C1","C1",null,null,null,null,"Percentuale delle opere di costruzione di dorsali di collettamento realizzate rispetto a quelle previste.","Numero di interventi di costruzione di dorsali di collettamento realizzati / Numero di interventi di costruzione di dorsali di collettamento previsti [%]",1,"non disponibile",0]
[null,"C1.1","C1","C1","35 Comuni",10044,"rilevata",1.7,"Percentuale di copertura del servizio di fognatura","Carico collettato / Carico complessivamente generato negli agglomerati ricadenti nell'ATO [%]",2,98.3,100]
[null,"C2.1","C2","C2",null,null,null,null,"Percentuale delle opere di manutenzione straordinaria delle reti fognarie realizzate rispetto a quelle previste.","Numero di interventi di manutenzione straordinaria delle reti fognarie realizzati / Numero di interventi di manutenzione straordinaria delle reti fognarie previsti [%]",1,"non disponibile","-"]
[null,"C2.1","C2","C2",null,null,null,null,"Percentuale delle opere di manutenzione straordinaria delle reti di collettamento realizzate rispetto a quelle previste.","Numero di interventi di manutenzione straordinaria delle reti di collettamento realizzati / Numero di interventi di manutenzione straordinaria delle reti di collettamento previsti [%]",1,"non disponibile","-"]
[null,"C2.3","C2","C2",null,null,null,null,"Percentuale delle opere di manutenzione straordinaria delle stazioni di sollevamento realizzate rispetto a quelle previste.","Numero di interventi di manutenzione straordinaria delle stazioni di sollevamento realizzati / Numero di interventi di manutenzione straordinaria delle stazioni di sollevamento previsti [%]",1,"non disponibile","-"]
[null,"C2.8","C2","D2",null,null,null,null,"Percentuale delle opere di eliminazione delle acque estranee dai collettori realizzate rispetto a quelle previste.","Numero di interventi di eliminazione delle acque estranee dai collettori realizzati / Numero di interventi di eliminazione delle acque estranee dai collettori previsti [%]",1,"non disponibile","-"]
[null,"C4.1","C4","C4",null,null,null,null,"Numero di allagamenti all'anno per rete fognaria comunale","Numero di allagamenti generati da malfunzionamenti della rete fognaria segnalati nell'anno [Numero / anno]",1,"non disponibile","-"]
[null,"C4.2","C4","C2 / C3 / D2",null,null,null,null,"Numero di attivazioni all'anno degli scaricatori oltre le 96 ore dall'ultimo evento piovoso","Numero di attivazioni all'anno degli scaricatori oltre le 96 ore dall'ultimo evento piovoso segnalate nell'anno [Numero / anno]",1,"non disponibile","-"]
[null,"C8.1","C8","D4",null,null,null,null,"Numero di allagamenti generati da malfunzionamenti della rete fognaria a seguito di eventi piovosi","Numero di allagamenti generati da malfunzionamenti della rete fognaria segnalati nell'anno [Numero / anno]",1,"non disponibile","-"]
[null,"D1.1","D1","D1","Bellagio, Blevio, Garzeno, Torno",4713,"rilevata",0.5,"Percentuale di agglomerati provvisti di impianto di depurazione o di trattamento appropriato ","Agglomerati provvisti di impianto di depurazione / Numero agglomerati ricadenti nell'ATO [%]",1,{"$f":"(61-6)/61*100","v":90.163934426229503},100]
[null,"D1.4","D1","D4","Depuratori presenti nell'ATO con potenzialità >= 10000 AE con opere di adeguamento del terziario segnalate dal Gestore",178757,"rilevata",29.9,"Numero di depuratori con potenzialità >= 10000 AE con trattamento terziario assente o da adeguare","Numero di depuratori con potenzialità >= 10000 AE con trattamento terziario assente o da adeguare (sulla base delle opere segnalate dal Gestore) [Numero]",1,7,"-"]
[null,"D2.2","D2","D2",null,null,null,null,"Percentuale delle opere realizzate per l'adeguamento delle infrastrutture civili esistenti presso gli impianti (attuazione normativa sicurezza, locali accessori,...) rispetto a quelle previste","Numero di interventi realizzati per l'adeguamento delle infrastrutture civili esistenti presso gli impianti  / Numero di interventi previsti per l'adeguamento delle infrastrutture civili esistenti presso gli impianti [%]",1,"non disponibile","-"]
[null,"D2.4","D2","D4","11 Comuni",11407,"rilevata",1.9,"Carico domestico complessivamente generato negli agglomerati da centralizzare [AE]","-",2,11407,"-"]
[null,"D2.6","D2","D2","10 Depuratori con potenzialità >= 10000 AE e con linea fanghi senza controllo emissioni",216510,"rilevata",37.200000000000003,"Percentuale degli impianti di depurazione con potenzialità > 10000 AE e con linea fanghi dotati di sistemi di abbattimento delle emissioni odorose","Numero degli impianti di depurazione con potenzialità > 10000 AE e con linea fanghi dotati di sistemi di abbattimento delle emissioni odorose / Numero dei depuratori con potenzialità > 10000 AE e con linea fanghi che necessitano di un sistema di controllo delle emissioni odorose [%]",1,{"$f":"3/13*100","v":23.076923076923077},"-"]
[null,"D2.9","D2","D2","7 Depuratori",215037,"rilevata",29,"Giudizio di conformità annuale","Giudizio annuale espresso da ARPA Lombardia in merito alla conformità delle acque scaricate dai depuratori alla normativa vigente [per depuratori > 1999 AE: CONFORME / NON CONFORME; per depuratori <2000 AE: REGOLAMENTARE / NON REGOLAMENTARE]",1,"GIUDIZIO ARPA 2014:\nCONFORME / REGOLAMENTARE: 33 impianti\nNON CONFORMI / NON REGOLAMENTARI: 7 impianti;\nNON ESPRIMIBILE (per mancanza di dati): 25 impianti;","100% giudizi Conformi / Regolamentari"]
[null,"D3.1","D3","E2",null,null,null,null,"Quantità annua di fanghi complessivamente conferita in discarica","Quantità di fanghi smaltita annualmente in discarica (dato a livello di ATO) [tonn. / anno]",1,"non disponibile","-"]
[null,"D6.3","D6","D2",null,null,null,null,"Numero di attivazioni all'anno, oltre le 96 ore dall'ultimo evento piovoso, degli scaricatori in testa agli impianti di depurazione con carico >= 10.000 AE","-",1,"non disponibile","-"]

{"sheet":"Alternative & Selezioni","index":3,"n_rows":41,"n_cols":51,"rows_kept":41,"cut":false,"hidden":false,"merged":[[5,8,6,8],[5,9,6,9],[5,10,6,10],[5,25,6,25],[5,11,6,11],[5,12,6,12],[5,13,6,13],[5,15,6,15],[5,16,6,16],[5,17,6,17],[5,19,6,19],[5,20,6,20],[5,21,6,21],[5,23,6,23],[5,24,6,24],[5,6,6,6],[5,1,6,1],[5,3,6,3],[5,4,6,4],[5,5,6,5],[5,2,6,2],[5,27,6,27],[5,28,6,28],[5,29,6,29],[5,31,6,31],[5,32,6,32],[5,46,6,46],[5,33,6,33],[5,35,6,35],[5,36,6,36],[5,37,6,37],[5,39,6,39],[5,34,6,34],[5,38,6,38],[5,50,6,50],[5,7,6,7],[5,14,6,14],[5,18,6,18],[5,22,6,22],[5,26,6,26],[5,30,6,30],[5,47,6,47],[5,48,6,48],[5,49,6,49],[5,40,6,40],[5,41,6,41],[5,43,6,43],[5,44,6,44],[5,45,6,45],[5,42,6,42]]}
[]
[null,"ATO",{"$f":"IF('Criticità & Indicatori'!C2=0,\"\",'Criticità & Indicatori'!C2)","v":"ATO CO - COMO"},"ID ATO",{"$f":"IF('Criticità & Indicatori'!E2=0,\"\",'Criticità & Indicatori'!E2)","v":304},null,null,"Dati PdI 2016-2019"]
[null,"Ente di Governo d'Ambito",{"$f":"IF('Criticità & Indicatori'!C3=0,\"\",'Criticità & Indicatori'!C3)","v":"Provincia di Como"},"ID Ente di Governo d'Ambito",{"$f":"IF('Criticità & Indicatori'!E3=0,\"\",'Criticità & Indicatori'!E3)","v":""}]
[null,"Soggetto Gestore",{"$f":"IF('Criticità & Indicatori'!C4=0,\"\",'Criticità & Indicatori'!C4)","v":"Como Acqua srl"},"ID Soggetto Gestore",{"$f":"IF('Criticità & Indicatori'!E4=0,\"\",'Criticità & Indicatori'!E4)","v":21521},null,null,"Dati PdI 2014-2017"]
[]
[null,"Criticità AEEGSI ex determina 2/2016/DSID","Sotto-area 2016-2019 ex determina 2/2016/DSID","ID intervento pianificato","Titolo Intervento pianificato","Costo totale intervento","Popolazione interessata intervento (ab.)","Livello obiettivo finale","Opzione 0\n(Titolo intervento)","Costo previsto Opzione 0","Popolazione interessata Opzione 0","Opzione 1\n(Titolo intervento)","Costo previsto Opzione 1","Popolazione interessata Opzione 1","Livello obiettivo Opzione 1","Opzione 2\n(Titolo intervento)","Costo previsto Opzione 2","Popolazione interessata Opzione 2","Livello obiettivo Opzione 2","Opzione 3\n(Titolo intervento)","Costo previsto Opzione 3","Popolazione interessata Opzione 3","Livello obiettivo Opzione 3","Opzione 4\n(Titolo intervento)","Costo previsto Opzione 4","Popolazione interessata Opzione 4","Livello obiettivo Opzione 4","Opzione 5\n(Titolo intervento)","Costo previsto Opzione 5","Popolazione interessata Opzione 5","Livello obiettivo Opzione 5","Opzione 6\n(Titolo intervento)","Costo previsto Opzione 6","Popolazione interessata Opzione 6","Livello obiettivo Opzione 6","Opzione 7\n(Titolo intervento)","Costo previsto Opzione 7","Popolazione interessata Opzione 7","Livello obiettivo Opzione 7","Opzione 8\n(Titolo intervento)","Costo previsto Opzione 8","Popolazione interessata Opzione 8","Livello obiettivo Opzione 8","Opzione 9\n(Titolo intervento)","Costo previsto Opzione 9","Popolazione interessata Opzione 9","Livello obiettivo Opzione 9","Opzione 10\n(Titolo intervento)","Costo previsto Opzione 10","Popolazione interessata Opzione 10","Livello obiettivo Opzione 10"]
[]
[null,"K1.1","K1",107,"RETI ACQUEDOTTISTICHE - Mappatura / Ricerche perdite / Studi",2315232.41,508066,100]
[null,"K1.1","K1",203,"RETI FOGNARIE - Mappatura / Ricerche perdite / Studi",1700098.0399999996,476635,100]
[null,"K3.1","K3",108,"RETI ACQUEDOTTISTICHE - Telecontrollo (posa / adeguamento)",248197,null,100]
[null,"K3.1","K3",406,"DEPURATORE ESISTENTE - Telecontrollo (posa / adeguamento)",316000,null,100]
[null,"A1.1","A1",102,"CAPTAZIONI - manutenzione straordinaria",3034058.3699999996,null,0]
[null,"A1.1","A1",103,"INTERCONNESSIONE RETI SOVRACOMUNALI",1265300,null,0]
[null,"A1.1","A1",104,"NUOVA CAPTAZIONE - Realizzazione e allacciamento alla rete",569465,null,0]
[null,"A1.4","A1",101,"AREE DI SALVAGUARDIA - adeguamento",1006452.5,549901,0]
[null,"P2.1","P2",106,"POTABILIZZATORI - nuove opere",573240.96,60449,"100% giudizi BUONI"]
[null,"P2.1","P2",105,"POTABILIZZATORI - adeguamento",1022540,633,"100% giudizi BUONI"]
[null,"B4.1","B4",110,"RETI DI DISTRIBUZIONE E ADDUZIONE - manutenzione straordinaria / rifacimenti",13154676.400000002,127812,0]
[null,"B7.1","B7",109,"RETI DI DISTRIBUZIONE E ADDUZIONE - estensione",791450,null,100]
[null,"B8.1","B8",111,"SERBATOI - adeguamento e ampliamento",4588433.3499999996,565404,100]
[null,"B8.1","B8",112,"SERBATOI - realizzazione di nuovo serbatoio",300000,null,100]
[null,"C1.1","C1",304,"NUOVA DORSALE DI COLLETTAMENTO (Realizzazione/estensione di nuovo tratto)",2080000,null,100]
[null,"C1.1","C1",201,"RETI FOGNARIE - Estensione - nuove opere",16933103.030000001,10044,100]
[null,"C2.1","C2",202,"RETI FOGNARIE - manutenzione straordinaria",14886976.290000008,null,100]
[null,"C2.1","C2",302,"DORSALE DI COLLETTAMENTO - manutenzione straordinaria / adeguamenti",16002892.689999999,null,100]
[null,"C2.3","C2",207,"STAZIONI DI SOLLEVAMENTO - manutenzione straordinaria",875707.90999999992,null,100]
[null,"C2.8","C2",301,"DORSALE DI COLLETTAMENTO - Adeguamento (eliminazione acque estranee)",800659.74,null,100]
[null,"C4.1","C4",204,"RETI FOGNARIE - Separazione reti miste - nuove opere",7540693.9399999985,null,"1 episodio/anno per Comune"]
[null,"C4.2","C4",206,"SCARICATORI DI PIENA - nuove opere (inserimento / adeguamento paratoie)",318492.5,null,"1 episodio/anno per scolmatore"]
[null,"C4.2","C4",205,"SCARICATORI DI PIENA - manutenzione straordinaria",4796100,null,"1 episodio/anno per scolmatore"]
[null,"C8.1","C8",305,"VASCA DI ACCUMULO ACQUE DI PRIMA PIOGGIA - Realizzazione",3880000,null,"1 episodio/anno per Comune"]
[null,"D1.1","D1",401,"COSTRUZIONE NUOVO IMPIANTO DI DEPURAZIONE E RELATIVI COLLETTORI",1533985.51,4659,100]
[null,"D1.4","D1",407,"DEPURATORE ESISTENTE > 10000 AE: adeguamento trattamento terziario",1470000,178757,0]
[null,"D2.2","D2",402,"DEPURATORE ESISTENTE - adeguamenti infrastrutture (attuazione normativa sicurezza, locali accessori,...)",862000,null,100]
[null,"D2.4","D2",303,"NUOVA DORSALE DI COLLETTAMENTO - attuazione schema/pianificazione",250000,11407,0]
[null,"D2.6","D2",404,"DEPURATORE ESISTENTE - adeguamento/posa sistema abbattimento emissioni odorose",1002000,216510,100]
[null,"D2.9","D2",403,"DEPURATORE ESISTENTE - adeguamento / manutenzione straordinaria (per rispetto limiti allo scarico)",12246571.389999999,215037,"100% giudizi Conformi / Regolamentari"]
[null,"D3.1","D3",408,"FANGHI - Interventi per diminuire conferimento in discarica",0,null,"Diminuzione del 5% nel periodo 2016-2034"]
[null,"D6.3","D6",405,"DEPURATORE ESISTENTE - realizzazione di vasca volano",3085000,null,"1 episodio/anno per depuratore"]
[null,"-","-",100,"ACQUEDOTTO - ALLACCIAMENTI",3467100,null,"-"]
[null,"-","-",200,"FOGNATURA - ALLACCIAMENTI",4460400,null,"-"]

{"sheet":"Cronoprogramma 2016-2019","index":4,"n_rows":1679,"n_cols":38,"rows_kept":1679,"cut":false,"hidden":false,"merged":[[1,9,1,12],[7,32,7,33],[7,11,8,11],[6,1,6,12],[6,24,6,27],[6,28,6,37],[6,20,6,23],[7,28,7,29],[7,30,7,31],[7,36,7,37],[7,34,7,35],[6,13,6,19],[7,1,8,1],[7,26,7,27],[7,24,7,25],[7,20,7,21],[7,22,7,23],[7,15,7,18],[7,13,7,14],[7,12,8,12],[7,3,8,3],[7,2,8,2],[7,10,8,10],[7,8,8,8],[7,9,8,9],[7,7,8,7],[7,5,8,5],[7,4,8,4],[7,6,8,6]]}
[]
[null,null,null,null,null,null,null,null,null,"Aggiungi/Elimina righe",null,null,null,"N."]
[null,"ATO",{"$f":"IF('Criticità & Indicatori'!C2=0,\"\",'Criticità & Indicatori'!C2)","v":"ATO CO - COMO"},"ID ATO",{"$f":"IF('Criticità & Indicatori'!E2=0,\"\",'Criticità & Indicatori'!E2)","v":304},null,null,"Dati PdI 2016-2019",null,null,"Aggiunge a partire dalla prima riga vuota (NB compilare le prime due righe)",null,null,131]
[null,"Ente di Governo d'Ambito",{"$f":"IF('Criticità & Indicatori'!C3=0,\"\",'Criticità & Indicatori'!C3)","v":"Provincia di Como"},"ID Ente di Governo d'Ambito",{"$f":"IF('Criticità & Indicatori'!E3=0,\"\",'Criticità & Indicatori'!E3)","v":""},null,null,null,null,null,"Elimina righe vuote",null,null,1]
[null,"Soggetto Gestore",{"$f":"IF('Criticità & Indicatori'!C4=0,\"\",'Criticità & Indicatori'!C4)","v":"Como Acqua srl"},"ID Soggetto Gestore",{"$f":"IF('Criticità & Indicatori'!E4=0,\"\",'Criticità & Indicatori'!E4)","v":21521},null,null,"Dati PdI 2014-2017",null,null,"Elimina riga compilata: selezionare la riga che si intende eliminare"]
[]
[null,"Analisi interventi",null,null,null,null,null,null,null,null,null,null,null,"Valori obiettivo ",null,null,null,null,null,null,"Investimento realizzato ",null,null,null,"Investimento pianificato PdI 2014-2017",null,null,null,"Investimento pianificato PdI 2016-2019"]
[null,"ID intervento pianificato","Titolo Intervento pianificato","Intervento presente nel PdI 2014-2017?","Sotto-area 2016-2019 ex determina 2/2016/DSID","Criticità AEEGSI ex determina 2/2016/DSID","Popolazione interessata criticità (ab)","Popolazione interessata intervento (ab.)","Rilevata/ Stimata","Località interessata/e intervento","Iter autorizzativo concluso?","Stadio di progettazione/esecuzione","Entrata in esercizio prevista (anno)","PdI 2014-2017",null,"PdI 2016-2019",null,null,null,"Post 2019",2014,null,2015,null,2016,null,2017,null,2016,null,2017,null,2018,null,2019,null,"TOTALE 2016-2019"]
[null,null,null,null,null,null,null,null,null,null,null,null,null,2016,2017,2016,2017,2018,2019,"Anno? (Specificare)","Finanziato da tariffa","Finanziamento pubblico","Finanziato da tariffa","Finanziamento pubblico","Finanziato da tariffa","Finanziamento pubblico","Finanziato da tariffa","Finanziamento pubblico","Finanziato da tariffa","Finanziamento pubblico","Finanziato da tariffa","Finanziamento pubblico","Finanziato da tariffa","Finanziamento pubblico","Finanziato da tariffa","Finanziamento pubblico","Finanziato da tariffa","Finanziamento pubblico"]
[null,"107.13003.1","MAPPATURA RETI E PRESE E GOEREFERENZIAZIONE","No","K1","K1.1",508066,"",null,"Albavilla","N.A.","Studio di fattibilità",2016,"-","-",100,"-","-","-","-",null,null,null,null,null,null,null,null,32921.81,0,0,0,0,0,0,0,{"$f":"SUM(AC10+AE10+AG10+AI10)","v":32921.81},{"$f":"SUM(AD10+AF10+AH10+AJ10)","v":0}]
[null,"201.13041.1","Realizzazione fognatura via Milano","No","C1","C1.1",0,80,"rilevata","Albavilla","NO","",2016,"-","-","-","-","-","-","-",null,null,null,null,null,null,null,null,140000,0,0,0,0,0,0,0,{"$f":"SUM(AC11+AE11+AG11+AI11)","v":140000},{"$f":"SUM(AD11+AF11+AH11+AJ11)","v":0}]
[null,"203.13003.1","Albavilla_RETI FOGNARIE - Mappatura / Ricerche perdite / Studi (Agglomerato 1)","Sì","K1","K1.1",476635,"",null,"Albavilla","NO","",2016,"-","-",100,"-","-","-","-",null,null,null,null,null,null,null,null,3079.05,0,0,0,0,0,0,0,3079.05,0]
[null,"203.13003.1","Albavilla_RETI FOGNARIE - Mappatura / Ricerche perdite / Studi (Agglomerato 2)","Sì","K1","K1.1",476635,"",null,"Albavilla","NO","",2016,"-","-",100,"-","-","-","-",null,null,null,null,null,null,null,null,6670.95,0,0,0,0,0,0,0,6670.95,0]
[null,"107.13004.1","Albese con Cassano_RICERCA PERDITE / MAPPATURA RETE / STUDI","Sì","K1","K1.1",508066,"",null,"Albese con Cassano","N.A.","",2016,"-","-",100,"-","-","-","-",null,null,null,null,null,null,null,null,9750,0,0,0,0,0,0,0,9750,0]
[null,"203.13004.1","Albese con Cassano_RETI FOGNARIE - Mappatura / Ricerche perdite / Studi","Sì","K1","K1.1",476635,"",null,"Albese con Cassano","NO","",2016,"-","-",100,"-","-","-","-",null,null,null,null,null,null,null,null,9750,0,0,0,0,0,0,0,9750,0]
[null,"203.13005.1","Albiolo_RETI FOGNARIE - Mappatura / Ricerche perdite / Studi","Sì","K1","K1.1",476635,"",null,"Albiolo","NO","",2016,"-","-",100,"-","-","-","-",null,null,null,null,null,null,null,null,9750,0,0,0,0,0,0,0,9750,0]
[null,"107.13006.1","MAPPATURA RETI E PRESE E GOEREFERENZIAZIONE","No","K1","K1.1",508066,"",null,"Alserio","N.A.","Studio di fattibilità",2016,"-","-",100,"-","-","-","-",null,null,null,null,null,null,null,null,20000,0,0,0,0,0,0,0,20000,0]
[null,"203.13006.1","Alserio_RETI FOGNARIE - Mappatura / Ricerche perdite / Studi","Sì","K1","K1.1",476635,"",null,"Alserio","NO","",2016,"-","-",100,"-","-","-","-",null,null,null,null,null,null,null,null,9750,0,0,0,0,0,0,0,9750,0]
[null,"107.13007.1","Alzate Brianza_RICERCA PERDITE / MAPPATURA RETE / STUDI","Sì","K1","K1.1",508066,"",null,"Alzate Brianza","N.A.","",2016,"-","-",100,"-","-","-","-",null,null,null,null,null,null,null,null,5850,0,0,0,0,0,0,0,5850,0]
[null,"107.13007.3","CAMPAGNA RICERCA PERDITE","Sì","K1","K1.1",508066,"",null,"ALZATE BRIANZA","N.A.","",2016,"-","-",100,"-","-","-","-",null,null,null,null,null,null,null,null,3900,0,0,0,0,0,0,0,3900,0]
[null,"203.13007.1","Alzate Brianza_RETI FOGNARIE - Mappatura / Ricerche perdite / Studi - AGGLOMERATO 1","Sì","K1","K1.1",476635,"",null,"Alzate Brianza","NO","",2016,"-","-",100,"-","-","-","-",null,null,null,null,null,null,null,null,6451.58,0,0,0,0,0,0,0,6451.58,0]
[null,"203.13007.2","Alzate Brianza_RETI FOGNARIE - Mappatura / Ricerche perdite / Studi - AGGLOMERATO 2","Sì","K1","K1.1",476635,"",null,"Alzate Brianza","NO","",2016,"-","-",100,"-","-","-","-",null,null,null,null,null,null,null,null,3298.43,0,0,0,0,0,0,0,3298.43,0]
[null,"107.13009.2","RICERCA PERDITA PIU RIPARAZIONE PERDITE","Sì","K1","K1.1",508066,"",null,"ANZANO DEL PARCO","N.A.","",2016,"-","-",100,"-","-","-","-",null,null,null,null,null,null,null,null,8190,0,0,0,0,0,0,0,8190,0]
[null,"203.13009.1","Anzano del Parco_RETI FOGNARIE - Mappatura / Ricerche perdite / Studi","Sì","K1","K1.1",476635,"",null,"Anzano del Parco","NO","",2016,"-","-",100,"-","-","-","-",null,null,null,null,null,null,null,null,9750,0,0,0,0,0,0,0,9750,0]
[null,"100.13010.1","Allacciamenti alla rete acquedottistica","No","-","-",0,"",null,"Appiano Gentile","NO","",2016,"-","-","-","-","-","-","-",null,null,null,null,null,null,null,null,0,73600,0,0,0,0,0,0,0,73600]
[null,"200.13010.1","Allacciamenti alla rete fognaria","No","-","-",0,"",null,"Appiano Gentile","NO","",2016,"-","-","-","-","-","-","-",null,null,null,null,null,null,null,null,0,108560,0,0,0,0,0,0,0,108560]
[null,"201.13010.1","Tronco di fognatura via C. Colombo","Sì","C1","C1.1",0,115,"rilevata","Appiano Gentile","NO","Progetto definitivo",2016,"-","-","-","-","-","-","-",null,null,null,null,null,null,null,null,30000,490000,0,0,0,0,0,0,30000,490000]
[null,"203.13010.1","Appiano Gentile_RETI FOGNARIE - Mappatura / Ricerche perdite / Studi (Agglomerato 1)","Sì","K1","K1.1",476635,"",null,"Appiano Gentile","NO","",2016,"-","-",100,"-","-","-","-",null,null,null,null,null,null,null,null,9750,0,0,0,0,0,0,0,9750,0]
[null,"101.13011.1","POZZO DI SOLLEVAMENTO A LAGO PULIZIA CON PUNZONATURA E SOSTITUZIONE CAMICIA ","No","A1","A1.4",633,"",null,"Argegno","NO","Progetto definitivo",2016,"-","-","-","-","-","-","-",null,null,null,null,null,null,null,null,35000,0,0,0,0,0,0,0,35000,0]
[null,"107.13011.1","Argegno_RICERCA PERDITE / MAPPATURA RETE / STUDI","Sì","K1","K1.1",508066,"",null,"Argegno","N.A.","",2016,"-","-",100,"-","-","-","-",null,null,null,null,null,null,null,null,9750,0,0,0,0,0,0,0,9750,0]
[null,"111.13012.3","MESSA IN SICUREZZA DEGLI IMPINTI DI SOLLEVAMENTO E ACCUMULO ESISTENTI","No","B8","B8.1",0,"",null,"AROSIO","N.A.","Progetto esecutivo",2016,"-","-","-","-","-","-","-",null,null,null,null,null,null,null,null,23889.67,0,0,0,0,0,0,0,23889.67,0]
[null,"203.13012.1","Arosio_RETI FOGNARIE - Mappatura / Ricerche perdite / Studi","Sì","K1","K1.1",476635,"",null,"Arosio","NO","",2016,"-","-",100,"-","-","-","-",null,null,null,null,null,null,null,null,9435.08,0,0,0,0,0,0,0,9435.08,0]
[null,"203.13012.2","Arosio_RETI FOGNARIE - Mappatura / Ricerche perdite / Studi","Sì","K1","K1.1",476635,"",null,"Arosio","NO","",2016,"-","-",100,"-","-","-","-",null,null,null,null,null,null,null,null,253.5,0,0,0,0,0,0,0,253.5,0]
[null,"203.13012.3","Arosio_RETI FOGNARIE - Mappatura / Ricerche perdite / Studi","Sì","K1","K1.1",476635,"",null,"Arosio","NO","",2016,"-","-",100,"-","-","-","-",null,null,null,null,null,null,null,null,61.43,0,0,0,0,0,0,0,61.43,0]
[null,"203.13013.1","Asso_RETI FOGNARIE - Mappatura / Ricerche perdite / Studi","Sì","K1","K1.1",476635,"",null,"Asso","NO","",2016,"-","-",100,"-","-","-","-",null,null,null,null,null,null,null,null,9750,0,0,0,0,0,0,0,9750,0]
[null,"203.13015.1","Barni_RETI FOGNARIE - Mappatura / Ricerche perdite / Studi - AGGLOMERATO 1","Sì","K1","K1.1",476635,"",null,"Barni","NO","",2016,"-","-",100,"-","-","-","-",null,null,null,null,null,null,null,null,7786.35,0,0,0,0,0,0,0,7786.35,0]
[null,"203.13015.2","Barni_RETI FOGNARIE - Mappatura / Ricerche perdite / Studi - AGGLOMERATO 2","Sì","K1","K1.1",476635,"",null,"Barni","NO","",2016,"-","-",100,"-","-","-","-",null,null,null,null,null,null,null,null,1963.65,0,0,0,0,0,0,0,1963.65,0]
[null,"102.13019.1","CIVENNA - Lavori di manutenzione straordinaria, valorizzazione e messa a norma della sorgente Pradello-Marazza","No","A1","A1.1",0,"",null,"Bellagio","N.A.","Progetto esecutivo",2016,"-","-",0,"-","-","-","-",null,null,null,null,null,null,null,null,39250,0,0,0,0,0,0,0,39250,0]
[null,"104.13019.2","CIVENNA - Nuova sorgente di Palembri","No","A1","A1.1",60449,"",null,"Bellagio","NO","Progetto esecutivo",2016,"-","-",0,"-","-","-","-",null,null,null,null,null,null,null,null,18100,0,0,0,0,0,0,0,18100,0]
[null,"111.13019.3","Lavori di potenziamento acquedotto zona montana con funzione multipla a servizio delle attività agricole - 1° lotto","No","B8","B8.1",0,"",null,"Bellagio","NO","Progetto definitivo",2016,"-","-","-","-","-","-","-",null,null,null,null,null,null,null,null,36200,181000,0,0,0,0,0,0,36200,181000]
[null,"304.13019.1","Lavori di collettamento dei reflui urbani Civenna - Oliveto Lario - Parè - lotto G","No","C1","C1.1",0,"",null,"Bellagio","SI","Progetto esecutivo",2016,"-","-","-","-","-","-","-",null,null,null,null,null,null,null,null,0,540000,0,0,0,0,0,0,0,540000]
[null,"107.13022.1","Mappatura rete idrica  piano di ricerca perdite","Sì","K1","K1.1",508066,"",null,"Beregazzo con Figliaro","N.A.","Studio di fattibilità",2016,"-","-",100,"-","-","-","-",null,null,null,null,null,null,null,null,15600,0,0,0,0,0,0,0,15600,0]
[null,"203.13022.1","Beregazzo con Figliaro_RETI FOGNARIE - Mappatura / Ricerche perdite / Studi","Sì","K1","K1.1",476635,"",null,"Beregazzo con Figliaro","NO","",2016,"-","-",100,"-","-","-","-",null,null,null,null,null,null,null,null,9750,0,0,0,0,0,0,0,9750,0]
[null,"203.13023.1","Binago_RETI FOGNARIE - Mappatura / Ricerche perdite / Studi","Sì","K1","K1.1",476635,"",null,"Binago","NO","",2016,"-","-",100,"-","-","-","-",null,null,null,null,null,null,null,null,9750,0,0,0,0,0,0,0,9750,0]
[null,"203.13024.1","Bizzarone_RETI FOGNARIE - Mappatura / Ricerche perdite / Studi","Sì","K1","K1.1",476635,"",null,"Bizzarone","NO","",2016,"-","-",100,"-","-","-","-",null,null,null,null,null,null,null,null,9750,0,0,0,0,0,0,0,9750,0]
[null,"107.13025.1","Blessagno_RICERCA PERDITE / MAPPATURA RETE / STUDI","Sì","K1","K1.1",508066,"",null,"Blessagno","N.A.","",2016,"-","-",100,"-","-","-","-",null,null,null,null,null,null,null,null,9750,0,0,0,0,0,0,0,9750,0]
[null,"203.13025.1","Blessagno_RETI FOGNARIE - Mappatura / Ricerche perdite / Studi","Sì","K1","K1.1",476635,"",null,"Blessagno","NO","",2016,"-","-",100,"-","-","-","-",null,null,null,null,null,null,null,null,9750,0,0,0,0,0,0,0,9750,0]
[null,"203.13026.1","Blevio_RETI FOGNARIE - Mappatura / Ricerche perdite / Studi","Sì","K1","K1.1",476635,"",null,"Blevio","NO","",2016,"-","-",100,"-","-","-","-",null,null,null,null,null,null,null,null,9750,0,0,0,0,0,0,0,9750,0]
[null,"203.13029.1","Brenna_RETI FOGNARIE - Mappatura / Ricerche perdite / Studi","Sì","K1","K1.1",476635,"",null,"Brenna","NO","",2016,"-","-",100,"-","-","-","-",null,null,null,null,null,null,null,null,9750,0,0,0,0,0,0,0,9750,0]
[null,"305.13029.1","Vasca di accumulo acque di prima pioggia sul collettore Alzate B,za-Carugo (in Comune di Brenna)\nPrimo lotto funzionale  (vedi intervento AdPQ-3^fase -  cod. E03011)","Sì","C8","C8.1",210043.56,"",null,"BRENNA","NO","Progetto preliminare",2016,"-","-","massimo 1 episodio ogni 2 km di rete fognaria presenti nel Comune","-","-","-","-",null,null,null,null,null,null,null,null,1036328.66,193671.34,0,0,0,0,0,0,1036328.66,193671.34]
[null,"203.13030.1","Brienno_RETI FOGNARIE - Mappatura / Ricerche perdite / Studi","Sì","K1","K1.1",476635,"",null,"Brienno","NO","",2016,"-","-",100,"-","-","-","-",null,null,null,null,null,null,null,null,9750,0,0,0,0,0,0,0,9750,0]
[null,"201.13032.1","Ambito trasformazione AT1 (con opere di urbanizzazione primaria) - Collettamento via per Civiglio area Civiasch","Sì","C1","C1.1",0,91,"rilevata","Brunate","NO","Studio di fattibilità",2016,"-","-","-","-","-","-","-",null,null,null,null,null,null,null,null,60000,0,0,0,0,0,0,0,60000,0]
[null,"203.13032.1","Brunate_RETI FOGNARIE - Mappatura / Ricerche perdite / Studi","Sì","K1","K1.1",476635,"",null,"Brunate","NO","",2016,"-","-",100,"-","-","-","-",null,null,null,null,null,null,null,null,9750,0,0,0,0,0,0,0,9750,0]
[null,"106.13034.1","Costruzione impianto di strippaggio presso la centrale aziendale di Bulgarograsso per trattamento acque contaminate da solventi clorurati emunte dai pozzi aziendali Baragiola di Bulgarograsso e Patrioti di Guanzate","Sì","P2","P2.1",127812,"",null,"Bulgarograsso","NO","",2016,"-","-","100% giudizi almeno DISCRETO","-","-","-","-",null,null,null,null,null,null,null,null,65310.91,38689.089999999997,0,0,0,0,0,0,65310.91,38689.089999999997]
[null,"403.13034.1","adeguamento dei pretrattenti iniziali del depuratore di Bulgarograsso","No","D2","D2.9",0,"",null,"Bulgarograsso","NO","Progetto preliminare",2016,"-","-","100% giudizi Conformi / Regolamentari","-","-","-","-",null,null,null,null,null,null,null,null,328000,0,0,0,0,0,0,0,328000,0]
[null,"403.13034.2","realizzazione di by-pass interno della sezione biologica e di sedimentazione per i periodi di alta portata in caso di pioggie","No","D2","D2.9",0,"",null,"Bulgarograsso","NO","Progetto preliminare",2016,"-","-","100% giudizi Conformi / Regolamentari","-","-","-","-",null,null,null,null,null,null,null,null,242000,0,0,0,0,0,0,0,242000,0]
[null,"403.13034.1","interventi di adeguamento impianto di depurazione di Bulgarograsso","No","D2","D2.9",0,"",null,"Bulgarograsso","NO","",2016,"-","-","100% giudizi Conformi / Regolamentari","-","-","-","-",null,null,null,null,null,null,null,null,50000,0,0,0,0,0,0,0,50000,0]
[null,"202.13034.1","Rifacimento linea fognaria centro storico - via Battisti - ai prati -Mosaico","Sì","C2","C2.1",0,"",null,"Bulgarograsso","NO","Progetto preliminare",2016,"-","-","-","-","-","-","-",null,null,null,null,null,null,null,null,198609.65,138718.47,0,0,0,0,0,0,198609.65,138718.47]
[null,"107.13035.1","Cabiate_RICERCA PERDITE / MAPPATURA RETE / STUDI","Sì","K1","K1.1",508066,"",null,"Cabiate","N.A.","",2016,"-","-",100,"-","-","-","-",null,null,null,null,null,null,null,null,9750,0,0,0,0,0,0,0,{"$f":"SUM(AC59+AE59+AG59+AI59)","v":9750},{"$f":"SUM(AD59+AF59+AH59+AJ59)","v":0}]
[null,"202.13036.1","LAVORI DI “RISANAMENTO E RIFACIMENTO COLLETTORE FOGNARIO DI VIA S. ANNA, DALLA FRAZIONE DI CASLINO AL PIANO AL COLLETTORE CONSORTILE – COMUNE DI CADORAGO (CO)”","Sì","C2","C2.1",0,"",null,"Cadorago","SI","Progetto esecutivo",2016,"-","-","-","-","-","-","-",null,null,null,null,null,null,null,null,73573.89,252000,0,0,0,0,0,0,73573.89,252000]
[null,"202.13037.2","LAVORI URGENTI DI RIFACIMENTO RETE FOGNARIA E RETE ACQUEDOTTO DI VIA AI MONTI E VIA IV NOVEMBRE","No","C2","C2.1",0,"",null,"Caglio",null,"Progetto esecutivo",2016,"-","-","-","-","-","-","-",null,null,null,null,null,null,null,null,0,250000,0,0,0,0,0,0,0,250000]
[null,"202.13037.3","LAVORI URGENTI DI RIFACIMENTO RETE FOGNARIA E RETE ACQUEDOTTO NEL CENTRO (VIA CARBONINI - P.ZA VITTORIO EMANUELE E PIAZZA MERCATO)","No","C2","C2.1",0,"",null,"Caglio",null,"Progetto esecutivo",2016,"-","-","-","-","-","-","-",null,null,null,null,null,null,null,null,0,170000,0,0,0,0,0,0,0,170000]
[null,"203.13037.1","Caglio_RETI FOGNARIE - Mappatura / Ricerche perdite / Studi","Sì","K1","K1.1",476635,"",null,"Caglio","NO","",2016,"-","-",100,"-","-","-","-",null,null,null,null,null,null,null,null,9750,0,0,0,0,0,0,0,9750,0]
[null,"203.13038.1","Cagno_RETI FOGNARIE - Mappatura / Ricerche perdite / Studi","Sì","K1","K1.1",476635,"",null,"Cagno","NO","",2016,"-","-",100,"-","-","-","-",null,null,null,null,null,null,null,null,9750,0,0,0,0,0,0,0,9750,0]
[null,"100.13041.1","Allacciamenti alla rete acquedottistica","No","-","-",0,"",null,"Cantù","NO","",2016,"-","-","-","-","-","-","-",null,null,null,null,null,null,null,null,0,64000,0,0,0,0,0,0,0,64000]
[null,"102.13041.1","Cantù_CAPTAZIONI - manutenzione straordinaria (ulteriore int. pianificati non prioritari)","No","A1","A1.1",0,"",null,"Cantù","NO","Progetto preliminare",2016,"-","-",0,"-","-","-","-",null,null,null,null,null,null,null,null,8000,0,0,0,0,0,0,0,8000,0]
[null,"107.13041.1","Cantù_RICERCA PERDITE / MAPPATURA RETE / STUDI","Sì","K1","K1.1",508066,"",null,"Cantù","N.A.","",2016,"-","-",100,"-","-","-","-",null,null,null,null,null,null,null,null,9750,0,0,0,0,0,0,0,9750,0]
[null,"200.13041.1","Allacciamenti alla rete fognaria","No","-","-",0,"",null,"Cantù","NO","",2016,"-","-","-","-","-","-","-",null,null,null,null,null,null,null,null,0,94400,0,0,0,0,0,0,0,94400]
[null,"201.13041.1","Estensione fognatura via Como","No","C1","C1.1",0,"",null,"Cantù","NO","Progetto preliminare",2016,"-","-","-","-","-","-","-",null,null,null,null,null,null,null,null,90000,210000,0,0,0,0,0,0,90000,210000]
[null,"102.13042.1","Canzo_Pozzo Ca' Bianca","No","A1","A1.1",0,"",null,"Canzo","NO","Studio di fattibilità",2016,"-","-",0,"-","-","-","-",null,null,null,null,null,null,null,null,8000,0,0,0,0,0,0,0,8000,0]
[null,"203.13042.1","Canzo_RETI FOGNARIE - Mappatura / Ricerche perdite / Studi","Sì","K1","K1.1",476635,"",null,"Canzo","NO","",2016,"-","-",100,"-","-","-","-",null,null,null,null,null,null,null,null,9750,0,0,0,0,0,0,0,9750,0]
[null,"107.13043.1","Mappatura rete idrica  piano di ricerca perdite","No","K1","K1.1",508066,"",null,"Capiago Intimiano","N.A.","Studio di fattibilità",2016,"-","-",100,"-","-","-","-",null,null,null,null,null,null,null,null,19500,0,0,0,0,0,0,0,19500,0]
[null,"304.13043.1","Collettore fognario di collegamento rete fognaria di Capiago Intimiano","No","C1","C1.1",0,"",null,"Capiago Intimiano","NO","Progetto esecutivo",2016,"-","-","-","-","-","-","-",null,null,null,null,null,null,null,null,90000,0,0,0,0,0,0,0,90000,0]
[null,"203.13043.1","Capiago Intimiano_RETI FOGNARIE - Mappatura / Ricerche perdite / Studi","Sì","K1","K1.1",476635,"",null,"Capiago Intimiano","NO","",2016,"-","-",100,"-","-","-","-",null,null,null,null,null,null,null,null,9750,0,0,0,0,0,0,0,9750,0]
[null,"107.13044.1","Carate Urio_RICERCA PERDITE / MAPPATURA RETE / STUDI","Sì","K1","K1.1",508066,"",null,"Carate Urio","N.A.","",2016,"-","-",100,"-","-","-","-",null,null,null,null,null,null,null,null,9750,0,0,0,0,0,0,0,9750,0]
[null,"201.13044.1","Realizzazione Nuovo tratto di fognatura - località Sassello (lotto 2)","No","C1","C1.1",0,"",null,"Carate Urio","NO","Progetto preliminare",2016,"-","-","-","-","-","-","-",null,null,null,null,null,null,null,null,79606.14,314500,0,0,0,0,0,0,79606.14,314500]
[null,"405.13046.1","vasche di accumulo / fitodepurazione","Sì","D6","D6.3",0,"",null,"Carimate","SI","Progetto esecutivo",2016,"-","-","1 episodio/anno per depuratore","-","-","-","-",null,null,null,null,null,null,null,null,160000,2000000,0,0,0,0,0,0,160000,2000000]
[null,"203.13046.1","Carimate_RETI FOGNARIE - Mappatura / Ricerche perdite / Studi","Sì","K1","K1.1",476635,"",null,"Carimate","NO","",2016,"-","-",100,"-","-","-","-",null,null,null,null,null,null,null,null,9750,0,0,0,0,0,0,0,9750,0]
[null,"201.13047.1","Realizzazione collettori fognari in via per Naggio","Sì","C1","C1.1",0,40,"rilevata","Carlazzo",null,"Progetto esecutivo",2016,"-","-","-","-","-","-","-",null,null,null,null,null,null,null,null,130000,0,0,0,0,0,0,0,130000,0]
[null,"201.13047.2","Realizzazione collettori fognari in via Statale","Sì","C1","C1.1",0,30,"rilevata","Carlazzo",null,"Progetto esecutivo",2016,"-","-","-","-","-","-","-",null,null,null,null,null,null,null,null,68000,0,0,0,0,0,0,0,68000,0]
[null,"203.13047.1","Carlazzo_RETI FOGNARIE - Mappatura / Ricerche perdite / Studi (prioritario con attivazione immediata)","Sì","K1","K1.1",476635,"",null,"Carlazzo","NO","",2016,"-","-",100,"-","-","-","-",null,null,null,null,null,null,null,null,9750,0,0,0,0,0,0,0,9750,0]
[null,"111.13048.2","Lavori di risanamento strutturale del serbatoio pensile dell'acquedotto comunale","No","B8","B8.1",0,"",null,"CARUGO","NO","Progetto preliminare",2016,"-","-","-","-","-","-","-",null,null,null,null,null,null,null,null,90500,0,0,0,0,0,0,0,90500,0]
[null,"203.13048.1","Carugo_RETI FOGNARIE - Mappatura / Ricerche perdite / Studi - Agglomerato 1","Sì","K1","K1.1",476635,"",null,"Carugo","NO","",2016,"-","-",100,"-","-","-","-",null,null,null,null,null,null,null,null,9545.25,0,0,0,0,0,0,0,9545.25,0]
[null,"203.13048.2","Carugo_RETI FOGNARIE - Mappatura / Ricerche perdite / Studi - Agglomerato 2","Sì","K1","K1.1",476635,"",null,"Carugo","NO","",2016,"-","-",100,"-","-","-","-",null,null,null,null,null,null,null,null,204.75,0,0,0,0,0,0,0,204.75,0]
[null,"107.13050.1","Casasco d'Intelvi_RICERCA PERDITE / MAPPATURA RETE / STUDI","Sì","K1","K1.1",508066,"",null,"Casasco d'Intelvi","N.A.","",2016,"-","-",100,"-","-","-","-",null,null,null,null,null,null,null,null,9750,0,0,0,0,0,0,0,9750,0]
[null,"201.13050.1","Condotte fognarie nella frazione Piazza Grande \"lotto 1\"","No","C1","C1.1",0,35,"rilevata","Casasco d'Intelvi","NO","Progetto preliminare",2016,"-","-","-","-","-","-","-",null,null,null,null,null,null,null,null,179653.68,260346.32,0,0,0,0,0,0,179653.68,260346.32]
[null,"203.13050.1","Casasco d'Intelvi_RETI FOGNARIE - Mappatura / Ricerche perdite / Studi","Sì","K1","K1.1",476635,"",null,"Casasco d'Intelvi","NO","",2016,"-","-",100,"-","-","-","-",null,null,null,null,null,null,null,null,9750,0,0,0,0,0,0,0,9750,0]
[null,"203.13052.1","Caslino d'Erba_RETI FOGNARIE - Mappatura / Ricerche perdite / Studi","Sì","K1","K1.1",476635,"",null,"Caslino d'Erba","NO","",2016,"-","-",100,"-","-","-","-",null,null,null,null,null,null,null,null,9750,0,0,0,0,0,0,0,9750,0]
[null,"110.13053.1","Rifacimento rete via tiziano","No","B4","B4.1",10044,"",null,"Casnate con Bernate","NO","Studio di fattibilità",2016,"-","-","-","-","-","-","-",null,null,null,null,null,null,null,null,47100,0,0,0,0,0,0,0,47100,0]
[null,"107.13055.1","Mappatura rete idrica  piano di ricerca perdite","Sì","K1","K1.1",508066,"",null,"Cassina Rizzardi","N.A.","Studio di fattibilità",2016,"-","-",100,"-","-","-","-",null,null,null,null,null,null,null,null,15600,0,0,0,0,0,0,0,15600,0]
[null,"203.13055.1","Cassina Rizzardi_RETI FOGNARIE - Mappatura / Ricerche perdite / Studi","Sì","K1","K1.1",476635,"",null,"Cassina Rizzardi","NO","",2016,"-","-",100,"-","-","-","-",null,null,null,null,null,null,null,null,9750,0,0,0,0,0,0,0,9750,0]
[null,"203.13058.1","Castelmarte_RETI FOGNARIE - Mappatura / Ricerche perdite / Studi","Sì","K1","K1.1",476635,"",null,"Castelmarte","NO","",2016,"-","-",100,"-","-","-","-",null,null,null,null,null,null,null,null,9750,0,0,0,0,0,0,0,9750,0]
[null,"107.13059.1","Mappatura rete idrica  piano di ricerca perdite","Sì","K1","K1.1",508066,"",null,"Castelnuovo Bozzente","N.A.","Studio di fattibilità",2016,"-","-",100,"-","-","-","-",null,null,null,null,null,null,null,null,11775,0,0,0,0,0,0,0,11775,0]
[null,"403.13059.1","Messa in sicurezza delle strutture murarie delle vasche soggette a deterioramento e fessuramento","Sì","D2","D2.9",0,"",null,"Castelnuovo Bozzente","NO","Studio di fattibilità",2016,"-","-","100% giudizi Conformi / Regolamentari","-","-","-","-",null,null,null,null,null,null,null,null,20000,0,0,0,0,0,0,0,20000,0]
[null,"403.13059.1","Adeguamento del sistema di sollevamento dei reflui in ingresso","Sì","D2","D2.9",0,"",null,"Castelnuovo Bozzente","NO","Studio di fattibilità",2016,"-","-","100% giudizi Conformi / Regolamentari","-","-","-","-",null,null,null,null,null,null,null,null,15000,0,0,0,0,0,0,0,15000,0]
[null,"406.13059.1","Completamento sistema di telecontrollo del depuratore","Sì","K3","K3.1",0,"",null,"Castelnuovo Bozzente","N.A.","Studio di fattibilità",2016,"-","-","-","-","-","-","-",null,null,null,null,null,null,null,null,10000,0,0,0,0,0,0,0,10000,0]
[null,"203.13059.1","Castelnuovo Bozzente_RETI FOGNARIE - Mappatura / Ricerche perdite / Studi","Sì","K1","K1.1",476635,"",null,"Castelnuovo Bozzente","NO","",2016,"-","-",100,"-","-","-","-",null,null,null,null,null,null,null,null,9750,0,0,0,0,0,0,0,9750,0]
[null,"102.13060.1","RIPRISTINO E RECUPERO SORGENTI AD USO IDROPOTABILE  A SERVIZIO DELL'ACQUEDOTTO COMUNALE DI CASTIGLIONE D'INTELVI","Sì","A1","A1.1",0,"",null,"San Fedele Intelvi","N.A.","Progetto esecutivo",2016,"-","-",0,"-","-","-","-",null,null,null,null,null,null,null,null,32496.11,14500,0,0,0,0,0,0,32496.11,14500]
[null,"203.13061.1","Cavallasca_RETI FOGNARIE - Mappatura / Ricerche perdite / Studi - Agglomerato 1","Sì","K1","K1.1",476635,"",null,"Cavallasca","NO","",2016,"-","-",100,"-","-","-","-",null,null,null,null,null,null,null,null,770.25,0,0,0,0,0,0,0,770.25,0]
[null,"203.13061.2","Cavallasca_RETI FOGNARIE - Mappatura / Ricerche perdite / Studi - Agglomerato 2","Sì","K1","K1.1",476635,"",null,"Cavallasca","NO","",2016,"-","-",100,"-","-","-","-",null,null,null,null,null,null,null,null,8979.75,0,0,0,0,0,0,0,8979.75,0]
[null,"107.13062.1","Cavargna_RICERCA PERDITE / MAPPATURA RETE / STUDI","Sì","K1","K1.1",508066,"",null,"Cavargna","N.A.","",2016,"-","-",100,"-","-","-","-",null,null,null,null,null,null,null,null,9750,0,0,0,0,0,0,0,9750,0]
[null,"203.13062.1","Cavargna_RETI FOGNARIE - Mappatura / Ricerche perdite / Studi","Sì","K1","K1.1",476635,"",null,"Cavargna","NO","",2016,"-","-",100,"-","-","-","-",null,null,null,null,null,null,null,null,7391.48,0,0,0,0,0,0,0,7391.48,0]
[null,"203.13062.2","Cavargna - Dosso Finsuè_RETI FOGNARIE - Mappatura / Ricerche perdite / Studi","Sì","K1","K1.1",476635,"",null,"Cavargna","NO","",2016,"-","-",100,"-","-","-","-",null,null,null,null,null,null,null,null,1967.55,0,0,0,0,0,0,0,1967.55,0]
[null,"203.13062.3","Cavargna - Mondrago_RETI FOGNARIE - Mappatura / Ricerche perdite / Studi","Sì","K1","K1.1",476635,"",null,"Cavargna","NO","",2016,"-","-",100,"-","-","-","-",null,null,null,null,null,null,null,null,390.98,0,0,0,0,0,0,0,390.98,0]
[null,"201.13063.1","REALIZZAZIONE FOGNATURA ACQUE NERE IN VIA FONTANA","No","C1","C1.1",0,"",null,"Cerano d'Intelvi",null,"Progetto esecutivo",2016,"-","-","-","-","-","-","-",null,null,null,null,null,null,null,null,60000,0,0,0,0,0,0,0,60000,0]
[null,"203.13064.1","Cermenate_RETI FOGNARIE - Mappatura / Ricerche perdite / Studi","Sì","K1","K1.1",476635,"",null,"Cermenate","NO","",2016,"-","-",100,"-","-","-","-",null,null,null,null,null,null,null,null,9750,0,0,0,0,0,0,0,9750,0]
[null,"200.13065.1","Allacciamenti alla rete fognaria","No","-","-",0,"",null,"Cernobbio","NO","",2016,"-","-","-","-","-","-","-",null,null,null,null,null,null,null,null,0,37760,0,0,0,0,0,0,0,37760]
[null,"201.13065.1","Fognatura Via Umberto I° e Via Pasubio","No","C1","C1.1",0,"",null,"Cernobbio","NO","Progetto preliminare",2016,"-","-","-","-","-","-","-",null,null,null,null,null,null,null,null,200000,0,0,0,0,0,0,0,200000,0]
[null,"107.13068.1","Cirimido_RICERCA PERDITE / MAPPATURA RETE / STUDI","Sì","K1","K1.1",508066,"",null,"Cirimido","N.A.","",2016,"-","-",100,"-","-","-","-",null,null,null,null,null,null,null,null,9750,0,0,0,0,0,0,0,9750,0]
[null,"203.13068.1","Cirimido_RETI FOGNARIE - Mappatura / Ricerche perdite / Studi (prioritario con attivazione immediata)","Sì","K1","K1.1",476635,"",null,"Cirimido","NO","",2016,"-","-",100,"-","-","-","-",null,null,null,null,null,null,null,null,9750,0,0,0,0,0,0,0,9750,0]
[null,"107.13071.1","Claino con Osteno_RICERCA PERDITE / MAPPATURA RETE / STUDI","Sì","K1","K1.1",508066,"",null,"Claino con Osteno","N.A.","",2016,"-","-",100,"-","-","-","-",null,null,null,null,null,null,null,null,5005.6000000000004,0,0,0,0,0,0,0,5005.6000000000004,0]
[null,"203.13071.1","Claino con Osteno_RETI FOGNARIE - Mappatura / Ricerche perdite / Studi (prioritario con attivazione immediata)","Sì","K1","K1.1",476635,"",null,"Claino con Osteno","NO","",2016,"-","-",100,"-","-","-","-",null,null,null,null,null,null,null,null,9750,0,0,0,0,0,0,0,9750,0]
[null,"107.13074.1","Colonno_RICERCA PERDITE / MAPPATURA RETE / STUDI","Sì","K1","K1.1",508066,"",null,"Colonno","N.A.","",2016,"-","-",100,"-","-","-","-",null,null,null,null,null,null,null,null,9750,0,0,0,0,0,0,0,9750,0]
[null,"203.13074.1","Colonno_RETI FOGNARIE - Mappatura / Ricerche perdite / Studi (prioritario con attivazione immediata)","Sì","K1","K1.1",476635,"",null,"Colonno","NO","",2016,"-","-",100,"-","-","-","-",null,null,null,null,null,null,null,null,9750,0,0,0,0,0,0,0,9750,0]
[null,"107.13251.3","Colverde_RICERCA PERDITE / MAPPATURA RETE / STUDI (ulteriore int. pianificati non prioritari)","Sì","K1","K1.1",508066,"",null,"Colverde","N.A.","",2016,"-","-",100,"-","-","-","-",null,null,null,null,null,null,null,null,9750,0,0,0,0,0,0,0,9750,0]
[null,"200.13075.1","Allacciamenti alla rete fognaria - Agglomerato 1","No","-","-",0,"",null,"Como","NO","",2016,"-","-","-","-","-","-","-",null,null,null,null,null,null,null,null,0,219008,0,0,0,0,0,0,0,219008]
[null,"304.13075.1","collettore Trecallo","Sì","C1","C1.1",0,"950","rilevata","Como","SI","Progetto esecutivo",2016,"-","-","-","-","-","-","-",null,null,null,null,null,null,null,null,0,300000,0,0,0,0,0,0,0,300000]
[null,"201.13075.1","Fognatura Nera Valbasca","Sì","C1","C1.1",0,92,"rilevata","Como","NO","Progetto definitivo",2016,"-","-","-","-","-","-","-",null,null,null,null,null,null,null,null,20457.63,163220.34,0,0,0,0,0,0,20457.63,163220.34]
[null,"201.13075.2","Fognatura nera via Silva (FG01307526)","Sì","C1","C1.1",0,28,"rilevata","Como","NO","",2016,"-","-","-","-","-","-","-",null,null,null,null,null,null,null,null,100000,0,0,0,0,0,0,0,100000,0]
[null,"202.13075.1","Fognatura S.Agostino","Sì","C2","C2.1",0,"",null,"Como","SI","Progetto esecutivo",2016,"-","-","-","-","-","-","-",null,null,null,null,null,null,null,null,0,416842.28,0,0,0,0,0,0,0,416842.28]
[null,"202.13075.2","Manutenzione straordinaria F.N. - Via Vittorio Emanuele II (Vicolo)","Sì","C2","C2.1",0,"",null,"Como","NO","",2016,"-","-","-","-","-","-","-",null,null,null,null,null,null,null,null,50000,0,0,0,0,0,0,0,50000,0]
[null,"203.13075.1","Como_RETI FOGNARIE - Mappatura / Ricerche perdite / Studi - Agglomerato 1","Sì","K1","K1.1",476635,"",null,"Como","NO","",2016,"-","-",100,"-","-","-","-",null,null,null,null,null,null,null,null,702.98,0,0,0,0,0,0,0,702.98,0]
[null,"203.13075.2","Como_RETI FOGNARIE - Mappatura / Ricerche perdite / Studi - Agglomerato 2","Sì","K1","K1.1",476635,"",null,"Como","NO","",2016,"-","-",100,"-","-","-","-",null,null,null,null,null,null,null,null,8347.9500000000007,0,0,0,0,0,0,0,{"$f":"SUM(AC123+AE123+AG123+AI123)","v":8347.9500000000007},{"$f":"SUM(AD123+AF123+AH123+AJ123)","v":0}]
[null,"203.13075.3","Como_RETI FOGNARIE - Mappatura / Ricerche perdite / Studi - Agglomerato 3","Sì","K1","K1.1",476635,"",null,"Como","NO","",2016,"-","-",100,"-","-","-","-",null,null,null,null,null,null,null,null,699.08,0,0,0,0,0,0,0,699.08,0]
[null,"207.13075.1","Manutenzione straordinaria stazioni di sollevamento e dissabbiatori - intervento 1","No","C2","C2.3",4659,"",null,"Como","NO","",2016,"-","-","-","-","-","-","-",null,null,null,null,null,null,null,null,100000,0,0,0,0,0,0,0,100000,0]
[null,"101.13077.1","MANUTENZIONE STRAORDINARIA ACQUEDOTTO E FOGNATURA LOCALITA' MONTI DI CROCC E SORGENTE VALLE MOTTER","No","A1","A1.4",633,"",null,"Corrido","NO","Progetto esecutivo",2016,"-","-","-","-","-","-","-",null,null,null,null,null,null,null,null,50000,0,0,0,0,0,0,0,50000,0]
[null,"107.13077.1","Corrido_RICERCA PERDITE / MAPPATURA RETE / STUDI","Sì","K1","K1.1",508066,"",null,"Corrido","N.A.","",2016,"-","-",100,"-","-","-","-",null,null,null,null,null,null,null,null,9750,0,0,0,0,0,0,0,9750,0]
[null,"203.13083.1","Cremia_RETI FOGNARIE - Mappatura / Ricerche perdite / Studi (prioritario con attivazione immediata)","Sì","K1","K1.1",476635,"",null,"Cremia","NO","",2016,"-","-",100,"-","-","-","-",null,null,null,null,null,null,null,null,9750,0,0,0,0,0,0,0,9750,0]
[null,"107.13084.1","Mappatura rete idrica  piano di ricerca perdite","Sì","K1","K1.1",508066,"",null,"Cucciago","N.A.","Studio di fattibilità",2016,"-","-",100,"-","-","-","-",null,null,null,null,null,null,null,null,15600,0,0,0,0,0,0,0,15600,0]
[null,"107.13085.1","Cusino_RICERCA PERDITE / MAPPATURA RETE / STUDI","Sì","K1","K1.1",508066,"",null,"Cusino","N.A.","",2016,"-","-",100,"-","-","-","-",null,null,null,null,null,null,null,null,9750,0,0,0,0,0,0,0,9750,0]
[null,"203.13087.1","Dizzasco_RETI FOGNARIE - Mappatura / Ricerche perdite / Studi","Sì","K1","K1.1",476635,"",null,"Dizzasco","NO","",2016,"-","-",100,"-","-","-","-",null,null,null,null,null,null,null,null,9750,0,0,0,0,0,0,0,9750,0]
[null,"107.13089.1","Domaso_RICERCA PERDITE / MAPPATURA RETE / STUDI","Sì","K1","K1.1",508066,"",null,"Domaso","N.A.","",2016,"-","-",100,"-","-","-","-",null,null,null,null,null,null,null,null,9750,0,0,0,0,0,0,0,9750,0]
[null,"107.13090.1","Dongo_RICERCA PERDITE / MAPPATURA RETE / STUDI","Sì","K1","K1.1",508066,"",null,"Dongo","N.A.","",2016,"-","-",100,"-","-","-","-",null,null,null,null,null,null,null,null,9750,0,0,0,0,0,0,0,9750,0]
[null,"201.13090.1","LAVORI DI COSTRUZIONE FOGNATURA IN LOCALITA' LIDO","No","C1","C1.1",0,"",null,"Dongo","NO","Progetto preliminare",2016,"-","-","-","-","-","-","-",null,null,null,null,null,null,null,null,127000,0,0,0,0,0,0,0,127000,0]
[null,"203.13090.1","Dongo_RETI FOGNARIE - Mappatura / Ricerche perdite / Studi","Sì","K1","K1.1",476635,"",null,"Dongo","NO","",2016,"-","-",100,"-","-","-","-",null,null,null,null,null,null,null,null,9750,0,0,0,0,0,0,0,9750,0]
[null,"107.13092.1","Dosso del Liro_RICERCA PERDITE / MAPPATURA RETE / STUDI","Sì","K1","K1.1",508066,"",null,"Dosso del Liro","N.A.","",2016,"-","-",100,"-","-","-","-",null,null,null,null,null,null,null,null,9750,0,0,0,0,0,0,0,9750,0]
[null,"203.13092.1","Dosso del Liro_RETI FOGNARIE - Mappatura / Ricerche perdite / Studi (prioritario con attivazione immediata)","Sì","K1","K1.1",476635,"",null,"Dosso del Liro","NO","",2016,"-","-",100,"-","-","-","-",null,null,null,null,null,null,null,null,9750,0,0,0,0,0,0,0,9750,0]
[null,"100.13095.1","Allacciamenti alla rete acquedottistica","No","-","-",0,"",null,"Erba","NO","",2016,"-","-","-","-","-","-","-",null,null,null,null,null,null,null,null,0,150400,0,0,0,0,0,0,0,150400]
[null,"101.13095.1","Campo pozzi Segrino","No","A1","A1.4",633,"",null,"Longone al Segrino","NO","Progetto preliminare",2016,"-","-","-","-","-","-","-",null,null,null,null,null,null,null,null,27150,0,0,0,0,0,0,0,27150,0]
[null,"105.13095.1","SERBATOIO ALPE DE VICERE'\ninstallazione nuovo impianto automatico disinfezione acqua con ipoclorito di sodio (in siostituzione di quello esistente vetusto).","No","P2","P2.1",0,"",null,"Erba","N.A.","Progetto esecutivo",2016,"-","-","100% giudizi almeno DISCRETO","-","-","-","-",null,null,null,null,null,null,null,null,5000,0,0,0,0,0,0,0,5000,0]
[null,"105.13095.2","Impianto disinfezione serbatoio Boccogna","Sì","P2","P2.1",0,"",null,"Erba","NO","Progetto preliminare",2016,"-","-","100% giudizi almeno DISCRETO","-","-","-","-",null,null,null,null,null,null,null,null,19910,0,0,0,0,0,0,0,19910,0]
[null,"108.13095.1","Telecontrollo (ammodernamento generale)","Sì","K3","K3.1",0,"",null,"Erba","N.A.","Progetto preliminare",2016,"-","-","-","-","-","-","-",null,null,null,null,null,null,null,null,49775,0,0,0,0,0,0,0,49775,0]
[null,"302.13095.1","Ampliamento stazione di sollevamento acque reflue di via per Alserio - costruzione nuova condotta di mandata","Sì","C2","C2.1",0,"",null,"Erba","NO","Progetto esecutivo",2016,"-","-","-","-","-","-","-",null,null,null,null,null,null,null,null,418082.6,338964.59,0,0,0,0,0,0,418082.6,338964.59]
[null,"200.13095.1","Allacciamenti alla rete fognaria","No","-","-",0,"",null,"Erba","NO","",2016,"-","-","-","-","-","-","-",null,null,null,null,null,null,null,null,0,221840,0,0,0,0,0,0,0,221840]
[null,"201.13095.1","Completamento rete fognaria nelle porzioni di agglomerato definite \"Zone servibili\"","Sì","C1","C1.1",0,"",null,"Erba",null,"Progetto esecutivo",2016,"-","-","-","-","-","-","-",null,null,null,null,null,null,null,null,340000,500000,0,0,0,0,0,0,340000,500000]
[null,"203.13097.1","Eupilio_RETI FOGNARIE - Mappatura / Ricerche perdite / Studi (prioritario con attivazione immediata)","Sì","K1","K1.1",476635,"",null,"Eupilio","NO","",2016,"-","-",100,"-","-","-","-",null,null,null,null,null,null,null,null,9750,0,0,0,0,0,0,0,9750,0]
[null,"107.13099.1","Faloppio_RICERCA PERDITE / MAPPATURA RETE / STUDI (ulteriore int. pianificati non prioritari)","Sì","K1","K1.1",508066,"",null,"Faloppio","N.A.","",2016,"-","-",100,"-","-","-","-",null,null,null,null,null,null,null,null,9750,0,0,0,0,0,0,0,9750,0]
[null,"302.13099.1","Rifacimento collettore sovracomunale \"Faloppia\" - 1° lotto","Sì","C2","C2.1",0,"",null,"Faloppio","NO","Progetto preliminare",2016,"-","-","-","-","-","-","-",null,null,null,null,null,null,null,null,100025,284625,0,0,0,0,0,0,100025,284625]
[null,"203.13099.1","Faloppio_RETI FOGNARIE - Mappatura / Ricerche perdite / Studi (prioritario con attivazione immediata)","Sì","K1","K1.1",476635,"",null,"Faloppio","NO","",2016,"-","-",100,"-","-","-","-",null,null,null,null,null,null,null,null,9750,0,0,0,0,0,0,0,9750,0]
[null,"107.13100.1","Fenegrò_RICERCA PERDITE / MAPPATURA RETE / STUDI","Sì","K1","K1.1",508066,"",null,"Fenegrò","N.A.","",2016,"-","-",100,"-","-","-","-",null,null,null,null,null,null,null,null,9750,0,0,0,0,0,0,0,9750,0]
[null,"203.13100.1","Fenegrò_RETI FOGNARIE - Mappatura / Ricerche perdite / Studi (prioritario con attivazione immediata)","Sì","K1","K1.1",476635,"",null,"Fenegrò","NO","",2016,"-","-",100,"-","-","-","-",null,null,null,null,null,null,null,null,9750,0,0,0,0,0,0,0,9750,0]
[null,"107.13102.1","Adeguamento mappatura rete idrica  piano di ricerca perdite","Sì","K1","K1.1",508066,"",null,"Fino Mornasco","N.A.","Studio di fattibilità",2016,"-","-",100,"-","-","-","-",null,null,null,null,null,null,null,null,23400,0,0,0,0,0,0,0,23400,0]
[null,"111.13102.1","Adeguamento serbatoio Gervasio","No","B8","B8.1",0,"",null,"Fino Mornasco","NO","Studio di fattibilità",2016,"-","-","-","-","-","-","-",null,null,null,null,null,null,null,null,135750,0,0,0,0,0,0,0,135750,0]
[null,"403.13102.1","Stazione di stoccaggio e dosaggio decolorante","No","D2","D2.9",0,"",null,"Fino Mornasco","NO","",2016,"-","-","100% giudizi Conformi / Regolamentari","-","-","-","-",null,null,null,null,null,null,null,null,35000,0,0,0,0,0,0,0,35000,0]
[null,"403.13102.1","Stazione di stoccaggio e dosaggio decolorante","No","D2","D2.9",0,"",null,"Fino Mornasco","NO","",2016,"-","-","100% giudizi Conformi / Regolamentari","-","-","-","-",null,null,null,null,null,null,null,null,16000,0,0,0,0,0,0,0,16000,0]
[null,"403.13102.1","Manutenzione straordinaria sezione ozono","No","D2","D2.9",0,"",null,"Fino Mornasco","NO","",2016,"-","-","100% giudizi Conformi / Regolamentari","-","-","-","-",null,null,null,null,null,null,null,null,40000,0,0,0,0,0,0,0,40000,0]
[null,"202.13102.1","Rifacimento tratto rete fognatura via Dolomiti","Sì","C2","C2.1",0,"",null,"Fino Mornasco","NO","Studio di fattibilità",2016,"-","-","-","-","-","-","-",null,null,null,null,null,null,null,null,80000,0,0,0,0,0,0,0,80000,0]
[null,"107.13106.1","Garzeno_RICERCA PERDITE / MAPPATURA RETE / STUDI","Sì","K1","K1.1",508066,"",null,"Garzeno","N.A.","",2016,"-","-",100,"-","-","-","-",null,null,null,null,null,null,null,null,9750,0,0,0,0,0,0,0,9750,0]
[null,"105.13110.1","Intervento urgente di manutenzione straordinaria dell'impianto di potabilizzazione per la rimozione delle molecole LM6 e MEBIKAR","No","P2","P2.1",0,"",null,"Grandate","NO","Studio di fattibilità",2016,"-","-","100% giudizi almeno DISCRETO","-","-","-","-",null,null,null,null,null,null,null,null,46680,0,0,0,0,0,0,0,46680,0]
[null,"107.13110.1","Grandate_RICERCA PERDITE / MAPPATURA RETE / STUDI","Sì","K1","K1.1",508066,"",null,"Grandate","N.A.","",2016,"-","-",100,"-","-","-","-",null,null,null,null,null,null,null,null,9750,0,0,0,0,0,0,0,9750,0]
[null,"107.13111.1","Grandola ed Uniti_RICERCA PERDITE / MAPPATURA RETE / STUDI","Sì","K1","K1.1",508066,"",null,"Grandola ed Uniti","N.A.","",2016,"-","-",100,"-","-","-","-",null,null,null,null,null,null,null,null,9750,0,0,0,0,0,0,0,9750,0]
[null,"203.13111.1","Grandola ed Uniti_RETI FOGNARIE - Mappatura / Ricerche perdite / Studi (prioritario con attivazione immediata)","Sì","K1","K1.1",476635,"",null,"Grandola ed Uniti","NO","",2016,"-","-",100,"-","-","-","-",null,null,null,null,null,null,null,null,9750,0,0,0,0,0,0,0,9750,0]
[null,"107.13249.1","Gravedona ed Uniti_RICERCA PERDITE / MAPPATURA RETE / STUDI","Sì","K1","K1.1",508066,"",null,"Gravedona ed Uniti","N.A.","",2016,"-","-",100,"-","-","-","-",null,null,null,null,null,null,null,null,9750,0,0,0,0,0,0,0,9750,0]
[null,"203.13249.1","Gravedona ed Uniti_RETI FOGNARIE - Mappatura / Ricerche perdite / Studi","Sì","K1","K1.1",476635,"",null,"Gravedona ed Uniti","NO","",2016,"-","-",100,"-","-","-","-",null,null,null,null,null,null,null,null,9750,0,0,0,0,0,0,0,9750,0]
[null,"203.13113.1","Griante_RETI FOGNARIE - Mappatura / Ricerche perdite / Studi (prioritario con attivazione immediata)","Sì","K1","K1.1",476635,"",null,"Griante","NO","",2016,"-","-",100,"-","-","-","-",null,null,null,null,null,null,null,null,9750,0,0,0,0,0,0,0,9750,0]
[null,"203.13114.1","Guanzate_RETI FOGNARIE - Mappatura / Ricerche perdite / Studi","Sì","K1","K1.1",476635,"",null,"Guanzate","NO","",2016,"-","-",100,"-","-","-","-",null,null,null,null,null,null,null,null,9750,0,0,0,0,0,0,0,9750,0]
[null,"110.13118.1","Rifacimento rete acquedotto via Trieste","Sì","B4","B4.1",10044,"",null,"Inverigo","NO","",2016,"-","-","-","-","-","-","-",null,null,null,null,null,null,null,null,11775,0,0,0,0,0,0,0,11775,0]
[null,"107.13118.1","Inverigo_RICERCA PERDITE / MAPPATURA RETE / STUDI","Sì","K1","K1.1",508066,"",null,"Inverigo","N.A.","",2016,"-","-",100,"-","-","-","-",null,null,null,null,null,null,null,null,9750,0,0,0,0,0,0,0,9750,0]
[null,"200.13118.1","Allacciamenti alla rete fognaria","No","-","-",0,"",null,"Inverigo","NO","",2016,"-","-","-","-","-","-","-",null,null,null,null,null,null,null,null,0,28320,0,0,0,0,0,0,0,28320]
[null,"201.13118.1","FOGNATURA fraz. CREMNAGO VIA PRIVATA PEREGO (attuazione edificazione residenziale privata)","Sì","C1","C1.1",0,30,"rilevata","Inverigo","NO","Studio di fattibilità",2016,"-","-","-","-","-","-","-",null,null,null,null,null,null,null,null,60000,0,0,0,0,0,0,0,60000,0]
[null,"201.13118.3","FOGNATURA VIA MONTEBARRO-VIA MAGNI ALTA (3° LOTTO)","Sì","C1","C1.1",0,130,"rilevata","Inverigo","NO","Progetto definitivo",2016,"-","-","-","-","-","-","-",null,null,null,null,null,null,null,null,516000,0,0,0,0,0,0,0,516000,0]
[null,"201.13118.3","FOGNATURA VIA TRENTO","Sì","C1","C1.1",0,35,"rilevata","Inverigo","NO","Progetto definitivo",2016,"-","-","-","-","-","-","-",null,null,null,null,null,null,null,null,60000,0,0,0,0,0,0,0,60000,0]
[null,"203.13118.1","Inverigo_RETI FOGNARIE - Mappatura / Ricerche perdite / Studi - Agglomerato 1","Sì","K1","K1.1",476635,"",null,"Inverigo","NO","",2016,"-","-",100,"-","-","-","-",null,null,null,null,null,null,null,null,2364.38,0,0,0,0,0,0,0,2364.38,0]
[null,"203.13118.2","Inverigo_RETI FOGNARIE - Mappatura / Ricerche perdite / Studi - Agglomerato 2","Sì","K1","K1.1",476635,"",null,"Inverigo","NO","",2016,"-","-",100,"-","-","-","-",null,null,null,null,null,null,null,null,748.8,0,0,0,0,0,0,0,748.8,0]
[null,"203.13118.3","Inverigo_RETI FOGNARIE - Mappatura / Ricerche perdite / Studi - Agglomerato 3","Sì","K1","K1.1",476635,"",null,"Inverigo","NO","",2016,"-","-",100,"-","-","-","-",null,null,null,null,null,null,null,null,6636.83,0,0,0,0,0,0,0,6636.83,0]
[null,"203.13119.1","Laglio_RETI FOGNARIE - Mappatura / Ricerche perdite / Studi","Sì","K1","K1.1",476635,"",null,"Laglio","NO","",2016,"-","-",100,"-","-","-","-",null,null,null,null,null,null,null,null,9750,0,0,0,0,0,0,0,9750,0]
[null,"203.13120.1","Laino_RETI FOGNARIE - Mappatura / Ricerche perdite / Studi (prioritario con attivazione immediata)","Sì","K1","K1.1",476635,"",null,"Laino","NO","",2016,"-","-",100,"-","-","-","-",null,null,null,null,null,null,null,null,9750,0,0,0,0,0,0,0,9750,0]
[null,"107.13121.1","Lambrugo_RICERCA PERDITE / MAPPATURA RETE / STUDI","Sì","K1","K1.1",508066,"",null,"Lambrugo","N.A.","",2016,"-","-",100,"-","-","-","-",null,null,null,null,null,null,null,null,9750,0,0,0,0,0,0,0,9750,0]
[null,"111.13121.1","Messa in sicurezza degli impianti di sollevamento e accumulo esistenti","No","B8","B8.1",0,"",null,"Lambrugo","N.A.","Progetto esecutivo",2016,"-","-","-","-","-","-","-",null,null,null,null,null,null,null,null,5994.33,0,0,0,0,0,0,0,5994.33,0]
[null,"201.13122.2","Rete fognaria Belvedere parte terminale di viale Poletti","Sì","C1","C1.1",0,75,"rilevata","Lanzo d'Intelvi",null,"Progetto esecutivo",2016,"-","-","-","-","-","-","-",null,null,null,null,null,null,null,null,0,120000,0,0,0,0,0,0,0,120000]
[null,"107.13123.1","Lasnigo_RICERCA PERDITE / MAPPATURA RETE / STUDI","Sì","K1","K1.1",508066,"",null,"Lasnigo","N.A.","",2016,"-","-",100,"-","-","-","-",null,null,null,null,null,null,null,null,9750,0,0,0,0,0,0,0,9750,0]
[null,"301.13123.1","Opere di consolidamento idraulico e difesa idraulica a presidio del collettore consortile","No","C2","C2.8",178757,"",null,"Lasnigo","NO","Progetto esecutivo",2016,"-","-","-","-","-","-","-",null,null,null,null,null,null,null,null,7204.04,43455.7,0,0,0,0,0,0,7204.04,43455.7]
[null,"203.13123.1","Lasnigo_RETI FOGNARIE - Mappatura / Ricerche perdite / Studi","Sì","K1","K1.1",476635,"",null,"Lasnigo","NO","",2016,"-","-",100,"-","-","-","-",null,null,null,null,null,null,null,null,9750,0,0,0,0,0,0,0,9750,0]
[null,"100.13128.1","Allacciamenti alla rete acquedottistica","No","-","-",0,"",null,"Limido Comasco","NO","",2016,"-","-","-","-","-","-","-",null,null,null,null,null,null,null,null,0,8000,0,0,0,0,0,0,0,8000]
[null,"107.13128.1","Limido Comasco_RICERCA PERDITE / MAPPATURA RETE / STUDI","Sì","K1","K1.1",508066,"",null,"Limido Comasco","N.A.","",2016,"-","-",100,"-","-","-","-",null,null,null,null,null,null,null,null,9750,0,0,0,0,0,0,0,9750,0]
[null,"200.13128.1","Allacciamenti alla rete fognaria","No","-","-",0,"",null,"Limido Comasco","NO","",2016,"-","-","-","-","-","-","-",null,null,null,null,null,null,null,null,0,11800,0,0,0,0,0,0,0,11800]
[null,"107.13129.1","Lipomo_RICERCA PERDITE / MAPPATURA RETE / STUDI","Sì","K1","K1.1",508066,"",null,"Lipomo","N.A.","",2016,"-","-",100,"-","-","-","-",null,null,null,null,null,null,null,null,9750,0,0,0,0,0,0,0,{"$f":"SUM(AC187+AE187+AG187+AI187)","v":9750},{"$f":"SUM(AD187+AF187+AH187+AJ187)","v":0}]
[null,"107.13130.1","Livo_RICERCA PERDITE / MAPPATURA RETE / STUDI","Sì","K1","K1.1",508066,"",null,"Livo","N.A.","",2016,"-","-",100,"-","-","-","-",null,null,null,null,null,null,null,null,9750,0,0,0,0,0,0,0,9750,0]
[null,"203.13130.1","Livo_RETI FOGNARIE - Mappatura / Ricerche perdite / Studi","Sì","K1","K1.1",476635,"",null,"Livo","NO","",2016,"-","-",100,"-","-","-","-",null,null,null,null,null,null,null,null,9750,0,0,0,0,0,0,0,9750,0]
[null,"203.13131.1","Locate Varesino_RETI FOGNARIE - Mappatura / Ricerche perdite / Studi","Sì","K1","K1.1",476635,"",null,"Locate Varesino","NO","",2016,"-","-",100,"-","-","-","-",null,null,null,null,null,null,null,null,9750,0,0,0,0,0,0,0,9750,0]
[null,"205.13133.1","Adeguamento manufatto scolmatore 2C1 - Adeguamento opera civile","No","C4","C4.2",216510,"",null,"Lomazzo","NO","Studio di fattibilità",2016,"-","-","1 episodio/anno per scolmatore","-","-","-","-",null,null,null,null,null,null,null,null,18000,0,0,0,0,0,0,0,18000,0]
[null,"205.13133.2","Adeguamento manufatto scolmatore 4C1 - Adeguamento opera civile","Sì","C4","C4.2",216510,"",null,"Lomazzo","NO","Studio di fattibilità",2016,"-","-","1 episodio/anno per scolmatore","-","-","-","-",null,null,null,null,null,null,null,null,6000,0,0,0,0,0,0,0,6000,0]
[null,"206.13133.1","Adeguamento manufatto scolmatore 1C1 - Posa regolatore di portata","No","C4","C4.2",11407,"",null,"Lomazzo","NO","Studio di fattibilità",2016,"-","-","1 episodio/anno per scolmatore","-","-","-","-",null,null,null,null,null,null,null,null,7200,0,0,0,0,0,0,0,7200,0]
[null,"206.13133.2","Adeguamento manufatto scolmatore 2C1 - Posa regolatore di portata","No","C4","C4.2",11407,"",null,"Lomazzo","NO","Studio di fattibilità",2016,"-","-","1 episodio/anno per scolmatore","-","-","-","-",null,null,null,null,null,null,null,null,7200,0,0,0,0,0,0,0,7200,0]
[null,"206.13133.3","Adeguamento manufatto scolmatore 4C1 - Posa regolatore di portata","No","C4","C4.2",11407,"",null,"Lomazzo","NO","Studio di fattibilità",2016,"-","-","1 episodio/anno per scolmatore","-","-","-","-",null,null,null,null,null,null,null,null,7200,0,0,0,0,0,0,0,7200,0]
[null,"106.13134.1","Manutenzione straordinaria al sistema acquedottistico comunale - lotto 2","Sì","P2","P2.1",127812,"",null,"Longone al Segrino","NO","Progetto preliminare",2016,"-","-","100% giudizi almeno DISCRETO","-","-","-","-",null,null,null,null,null,null,null,null,77622.5,186243.46,0,0,0,0,0,0,77622.5,186243.46]
[null,"106.13135.1","Problematica innalzamento concentrazioni solventi nel campo pozzi all’interno del golf monticello","No","P2","P2.1",127812,"",null,"Luisago","NO","Studio di fattibilità",2016,"-","-","100% giudizi almeno DISCRETO","-","-","-","-",null,null,null,null,null,null,null,null,45250,0,0,0,0,0,0,0,45250,0]
[null,"107.13135.1","Mappatura rete idrica  piano di ricerca perdite","Sì","K1","K1.1",508066,"",null,"Luisago","N.A.","Studio di fattibilità",2016,"-","-",100,"-","-","-","-",null,null,null,null,null,null,null,null,15600,0,0,0,0,0,0,0,15600,0]
[null,"203.13135.1","Luisago_RETI FOGNARIE - Mappatura / Ricerche perdite / Studi","Sì","K1","K1.1",476635,"",null,"Luisago","NO","",2016,"-","-",100,"-","-","-","-",null,null,null,null,null,null,null,null,9750,0,0,0,0,0,0,0,9750,0]
[null,"107.13136.1","SIMULAZIONE DINAMICA DELLA RETE, VALUTAZIONE PRESSIONI AI NOSDI E VELOCITA DEI RAMI PER PIANIIFICARE POTENZIAMENTI.","Sì","K1","K1.1",508066,"",null,"LURAGO D'ERBA","N.A.","",2016,"-","-",100,"-","-","-","-",null,null,null,null,null,null,null,null,31200,0,0,0,0,0,0,0,31200,0]
[null,"107.13137.1","Lurago Marinone_RICERCA PERDITE / MAPPATURA RETE / STUDI","Sì","K1","K1.1",508066,"",null,"Lurago Marinone","N.A.","",2016,"-","-",100,"-","-","-","-",null,null,null,null,null,null,null,null,9750,0,0,0,0,0,0,0,9750,0]
[null,"203.13137.1","Lurago Marinone_RETI FOGNARIE - Mappatura / Ricerche perdite / Studi","Sì","K1","K1.1",476635,"",null,"Lurago Marinone","NO","",2016,"-","-",100,"-","-","-","-",null,null,null,null,null,null,null,null,9750,0,0,0,0,0,0,0,9750,0]
[null,"107.13138.1","Mappatura rete idrica  piano di ricerca perdite","Sì","K1","K1.1",508066,"",null,"Lurate Caccivio","N.A.","Studio di fattibilità",2016,"-","-",100,"-","-","-","-",null,null,null,null,null,null,null,null,23400,0,0,0,0,0,0,0,23400,0]
[null,"107.13143.1","Censimento rete e derivazioni","Sì","K1","K1.1",508066,"",null,"Mariano Comense","N.A.","",2016,"-","-",100,"-","-","-","-",null,null,null,null,null,null,null,null,39000,0,0,0,0,0,0,0,39000,0]
[null,"404.13143.1","Prima fase sistema di riduzione delle emissioni odorose","No","D2","D2.6",0,"",null,"Mariano Comense","NO","Progetto esecutivo",2016,"-","-","-","-","-","-","-",null,null,null,null,null,null,null,null,750000,0,0,0,0,0,0,0,750000,0]
[null,"203.13143.1","Mariano Comense_RETI FOGNARIE - Mappatura / Ricerche perdite / Studi - Agglomerato 1","Sì","K1","K1.1",476635,"",null,"Mariano Comense","NO","",2016,"-","-",100,"-","-","-","-",null,null,null,null,null,null,null,null,7258.88,0,0,0,0,0,0,0,7258.88,0]
[null,"203.13143.2","Mariano Comense_RETI FOGNARIE - Mappatura / Ricerche perdite / Studi - Agglomerato 2","Sì","K1","K1.1",476635,"",null,"Mariano Comense","NO","",2016,"-","-",100,"-","-","-","-",null,null,null,null,null,null,null,null,1774.5,0,0,0,0,0,0,0,1774.5,0]
[null,"203.13143.3","Mariano Comense_RETI FOGNARIE - Mappatura / Ricerche perdite / Studi - Agglomerato 3","Sì","K1","K1.1",476635,"",null,"Mariano Comense","NO","",2016,"-","-",100,"-","-","-","-",null,null,null,null,null,null,null,null,716.63,0,0,0,0,0,0,0,716.63,0]
[null,"107.13144.1","Maslianico_RICERCA PERDITE / MAPPATURA RETE / STUDI","Sì","K1","K1.1",508066,"",null,"Maslianico","N.A.","",2016,"-","-",100,"-","-","-","-",null,null,null,null,null,null,null,null,9750,0,0,0,0,0,0,0,9750,0]
[null,"404.13147.1","Riduzione delle emissioni odorose - 1°lotto","Sì","D2","D2.6",0,"",null,"Merone","NO","Studio di fattibilità",2016,"-","-","-","-","-","-","-",null,null,null,null,null,null,null,null,80000,0,0,0,0,0,0,0,80000,0]
[null,"403.13147.1","Manutenzione straordinaria pozzetto fanghi primari","Sì","D2","D2.9",0,"",null,"Merone","NO","",2016,"-","-","100% giudizi Conformi / Regolamentari","-","-","-","-",null,null,null,null,null,null,null,null,60000,0,0,0,0,0,0,0,60000,0]
[null,"406.13147.1","Telecontrollo misuratori di portata delle utenze industriali - 1°lotto","No","K3","K3.1",0,"",null,"Merone","N.A.","Progetto esecutivo",2016,"-","-","-","-","-","-","-",null,null,null,null,null,null,null,null,30000,0,0,0,0,0,0,0,30000,0]
[null,"203.13147.1","Merone_RETI FOGNARIE - Mappatura / Ricerche perdite / Studi","Sì","K1","K1.1",476635,"",null,"Merone","NO","",2016,"-","-",100,"-","-","-","-",null,null,null,null,null,null,null,null,9750,0,0,0,0,0,0,0,9750,0]
[null,"107.13152.1","Moltrasio_RICERCA PERDITE / MAPPATURA RETE / STUDI","Sì","K1","K1.1",508066,"",null,"Moltrasio","N.A.","",2016,"-","-",100,"-","-","-","-",null,null,null,null,null,null,null,null,9750,0,0,0,0,0,0,0,9750,0]
[null,"203.13152.1","Moltrasio_RETI FOGNARIE - Mappatura / Ricerche perdite / Studi (prioritario con attivazione immediata)","Sì","K1","K1.1",476635,"",null,"Moltrasio","NO","",2016,"-","-",100,"-","-","-","-",null,null,null,null,null,null,null,null,9750,0,0,0,0,0,0,0,9750,0]
[null,"107.13153.1","Monguzzo_RICERCA PERDITE / MAPPATURA RETE / STUDI","Sì","K1","K1.1",508066,"",null,"Monguzzo","N.A.","",2016,"-","-",100,"-","-","-","-",null,null,null,null,null,null,null,null,9750,0,0,0,0,0,0,0,9750,0]
[null,"203.13153.1","Monguzzo_RETI FOGNARIE - Mappatura / Ricerche perdite / Studi","Sì","K1","K1.1",476635,"",null,"Monguzzo","NO","",2016,"-","-",100,"-","-","-","-",null,null,null,null,null,null,null,null,9750,0,0,0,0,0,0,0,9750,0]
[null,"107.13154.1","Montano Lucino_RICERCA PERDITE / MAPPATURA RETE / STUDI","Sì","K1","K1.1",508066,"",null,"Montano Lucino","N.A.","",2016,"-","-",100,"-","-","-","-",null,null,null,null,null,null,null,null,9750,0,0,0,0,0,0,0,9750,0]
[null,"107.13155.1","Montemezzo_RICERCA PERDITE / MAPPATURA RETE / STUDI","Sì","K1","K1.1",508066,"",null,"Montemezzo","N.A.","",2016,"-","-",100,"-","-","-","-",null,null,null,null,null,null,null,null,9750,0,0,0,0,0,0,0,9750,0]
[null,"203.13155.1","Montemezzo_RETI FOGNARIE - Mappatura / Ricerche perdite / Studi","Sì","K1","K1.1",476635,"",null,"Montemezzo","NO","",2016,"-","-",100,"-","-","-","-",null,null,null,null,null,null,null,null,9750,0,0,0,0,0,0,0,9750,0]
[null,"107.13157.1","Adeguamento mappatura rete idrica  piano di ricerca perdite","Sì","K1","K1.1",508066,"",null,"Montorfano","N.A.","Studio di fattibilità",2016,"-","-",100,"-","-","-","-",null,null,null,null,null,null,null,null,15600,0,0,0,0,0,0,0,15600,0]
[null,"203.13157.1","Montorfano_RETI FOGNARIE - Mappatura / Ricerche perdite / Studi","Sì","K1","K1.1",476635,"",null,"Montorfano","NO","",2016,"-","-",100,"-","-","-","-",null,null,null,null,null,null,null,null,9750,0,0,0,0,0,0,0,9750,0]
[null,"203.13159.1","Mozzate_RETI FOGNARIE - Mappatura / Ricerche perdite / Studi","Sì","K1","K1.1",476635,"",null,"Mozzate","NO","",2016,"-","-",100,"-","-","-","-",null,null,null,null,null,null,null,null,9750,0,0,0,0,0,0,0,9750,0]
[null,"107.13160.1","Musso_RICERCA PERDITE / MAPPATURA RETE / STUDI","Sì","K1","K1.1",508066,"",null,"Musso","N.A.","",2016,"-","-",100,"-","-","-","-",null,null,null,null,null,null,null,null,9750,0,0,0,0,0,0,0,9750,0]
[null,"203.13160.1","Musso_RETI FOGNARIE - Mappatura / Ricerche perdite / Studi","Sì","K1","K1.1",476635,"",null,"Musso","NO","",2016,"-","-",100,"-","-","-","-",null,null,null,null,null,null,null,null,9750,0,0,0,0,0,0,0,9750,0]
[null,"403.13161.1","Adeguamenti Impianto di Depurazione Nesso - Borgovecchio","No","D2","D2.9",0,"",null,"Nesso","NO","Progetto preliminare",2016,"-","-","100% giudizi Conformi / Regolamentari","-","-","-","-",null,null,null,null,null,null,null,null,70000,0,0,0,0,0,0,0,70000,0]
[null,"403.13161.2","sostituzione compressori e rifacimento quadri elettrici","No","D2","D2.9",0,"",null,"Nesso","NO","Progetto preliminare",2016,"-","-","100% giudizi Conformi / Regolamentari","-","-","-","-",null,null,null,null,null,null,null,null,50000,0,0,0,0,0,0,0,50000,0]
[null,"102.13163.1","INTERVENTO DI ADEGUAMENTO TECNOLOGICO   CENTRALE IDRICA \"MEDA\" ","No","A1","A1.1",0,"",null,"Novedrate","N.A.","Progetto esecutivo",2016,"-","-",0,"-","-","-","-",null,null,null,null,null,null,null,null,0,60000,0,0,0,0,0,0,0,60000]
[null,"107.13163.1","Novedrate_RICERCA PERDITE / MAPPATURA RETE / STUDI","Sì","K1","K1.1",508066,"",null,"Novedrate","N.A.","",2016,"-","-",100,"-","-","-","-",null,null,null,null,null,null,null,null,9750,0,0,0,0,0,0,0,9750,0]
[null,"111.13165.1","Adeguamento e sistemazione serbatoi località Somaino","No","B8","B8.1",0,"",null,"Olgiate Comasco","NO","Studio di fattibilità",2016,"-","-","-","-","-","-","-",null,null,null,null,null,null,null,null,362000,0,0,0,0,0,0,0,362000,0]
[null,"302.13165.2","Intervento prioritario di rifacimento collettore intecomunale n. 10 - Comune di Olgiate Comasco - LOTTO 1 - Via Milano - Via Rongio","No","C2","C2.1",0,"",null,"Olgiate Comasco","NO","Progetto definitivo",2016,"-","-","-","-","-","-","-",null,null,null,null,null,null,null,null,350000,0,0,0,0,0,0,0,350000,0]
[null,"302.13165.3","Intervento prioritario di rifacimento collettore intecomunale n. 10 - Comune di Olgiate Comasco - LOTTO 2 - Via Milano - Via Verga","No","C2","C2.1",0,"",null,"Olgiate Comasco","NO","Progetto definitivo",2016,"-","-","-","-","-","-","-",null,null,null,null,null,null,null,null,450000,0,0,0,0,0,0,0,450000,0]
[null,"203.13165.1","Olgiate Comasco_RETI FOGNARIE - Mappatura / Ricerche perdite / Studi - Agglomerato 1","Sì","K1","K1.1",476635,"",null,"Olgiate Comasco","NO","",2016,"-","-",100,"-","-","-","-",null,null,null,null,null,null,null,null,9205.9500000000007,0,0,0,0,0,0,0,9205.9500000000007,0]
[null,"203.13165.2","Olgiate Comasco_RETI FOGNARIE - Mappatura / Ricerche perdite / Studi - Agglomerato 2","Sì","K1","K1.1",476635,"",null,"Olgiate Comasco","NO","",2016,"-","-",100,"-","-","-","-",null,null,null,null,null,null,null,null,544.04999999999995,0,0,0,0,0,0,0,544.04999999999995,0]
[null,"105.13169.1","Rifacimento impianto di potabilizzazione di via Faverio","No","P2","P2.1",0,"",null,"Oltrona San Mamette","NO","Studio di fattibilità",2016,"-","-","100% giudizi almeno DISCRETO","-","-","-","-",null,null,null,null,null,null,null,null,100000,0,0,0,0,0,0,0,100000,0]
[null,"107.13169.1","Mappatura rete idrica  piano di ricerca perdite","Sì","K1","K1.1",508066,"",null,"Oltrona San Mamette","N.A.","Studio di fattibilità",2016,"-","-",100,"-","-","-","-",null,null,null,null,null,null,null,null,15600,0,0,0,0,0,0,0,15600,0]
[null,"107.13178.1","Peglio_RICERCA PERDITE / MAPPATURA RETE / STUDI","Sì","K1","K1.1",508066,"",null,"Peglio","N.A.","",2016,"-","-",100,"-","-","-","-",null,null,null,null,null,null,null,null,9750,0,0,0,0,0,0,0,9750,0]
[null,"203.13178.1","Peglio_RETI FOGNARIE - Mappatura / Ricerche perdite / Studi (prioritario con attivazione immediata)","Sì","K1","K1.1",476635,"",null,"Peglio","NO","",2016,"-","-",100,"-","-","-","-",null,null,null,null,null,null,null,null,9750,0,0,0,0,0,0,0,9750,0]
[null,"203.13179.1","Pellio Intelvi_RETI FOGNARIE - Mappatura / Ricerche perdite / Studi (prioritario con attivazione immediata)","Sì","K1","K1.1",476635,"",null,"Pellio Intelvi","NO","",2016,"-","-",100,"-","-","-","-",null,null,null,null,null,null,null,null,9750,0,0,0,0,0,0,0,9750,0]
[null,"107.13183.1","Pianello del Lario_RICERCA PERDITE / MAPPATURA RETE / STUDI","Sì","K1","K1.1",508066,"",null,"Pianello del Lario","N.A.","",2016,"-","-",100,"-","-","-","-",null,null,null,null,null,null,null,null,9750,0,0,0,0,0,0,0,9750,0]
[null,"203.13183.1","Pianello del Lario_RETI FOGNARIE - Mappatura / Ricerche perdite / Studi","Sì","K1","K1.1",476635,"",null,"Pianello del Lario","NO","",2016,"-","-",100,"-","-","-","-",null,null,null,null,null,null,null,null,9750,0,0,0,0,0,0,0,9750,0]
[null,"107.13184.1","Pigra_RICERCA PERDITE / MAPPATURA RETE / STUDI","Sì","K1","K1.1",508066,"",null,"Pigra","N.A.","",2016,"-","-",100,"-","-","-","-",null,null,null,null,null,null,null,null,9750,0,0,0,0,0,0,0,9750,0]
[null,"201.13185.1","Tutela dei bacini idrominerali e salvaguardia ambientale mediante la realizzazione del tronco fognario in località Calveseglio/Ligomena (FG01318504)","Sì","C1","C1.1",0,"",null,"Plesio","NO","Progetto preliminare",2016,"-","-","-","-","-","-","-",null,null,null,null,null,null,null,null,32333.02,72666.98,0,0,0,0,0,0,32333.02,72666.98]
[null,"201.13185.2","Realizzazione tratto fognario località Piazzo","Sì","C1","C1.1",0,25,"rilevata","Plesio","NO","",2016,"-","-","-","-","-","-","-",null,null,null,null,null,null,null,null,250000,0,0,0,0,0,0,0,250000,0]
[null,"107.13186.1","Pognana Lario_RICERCA PERDITE / MAPPATURA RETE / STUDI","Sì","K1","K1.1",508066,"",null,"Pognana Lario","N.A.","",2016,"-","-",100,"-","-","-","-",null,null,null,null,null,null,null,null,9750,0,0,0,0,0,0,0,9750,0]
[null,"203.13186.1","Pognana Lario_RETI FOGNARIE - Mappatura / Ricerche perdite / Studi","Sì","K1","K1.1",476635,"",null,"Pognana Lario","NO","",2016,"-","-",100,"-","-","-","-",null,null,null,null,null,null,null,null,9750,0,0,0,0,0,0,0,9750,0]
[null,"107.13187.1","Ponna_RICERCA PERDITE / MAPPATURA RETE / STUDI","No","K1","K1.1",508066,"",null,"Ponna","N.A.","",2016,"-","-",100,"-","-","-","-",null,null,null,null,null,null,null,null,20000,0,0,0,0,0,0,0,20000,0]
[null,"203.13187.1","Ponna_RETI FOGNARIE - Mappatura / Ricerche perdite / Studi","Sì","K1","K1.1",476635,"",null,"Ponna","NO","",2016,"-","-",100,"-","-","-","-",null,null,null,null,null,null,null,null,9750,0,0,0,0,0,0,0,9750,0]
[null,"107.13188.1","Ponte Lambro_RICERCA PERDITE / MAPPATURA RETE / STUDI","Sì","K1","K1.1",508066,"",null,"Ponte Lambro","N.A.","",2016,"-","-",100,"-","-","-","-",null,null,null,null,null,null,null,null,9750,0,0,0,0,0,0,0,9750,0]
[null,"203.13188.1","Ponte Lambro_RETI FOGNARIE - Mappatura / Ricerche perdite / Studi","Sì","K1","K1.1",476635,"",null,"Ponte Lambro","NO","",2016,"-","-",100,"-","-","-","-",null,null,null,null,null,null,null,null,9750,0,0,0,0,0,0,0,9750,0]
[null,"109.13189.1","Completamento captazione Valle dell'Alpe con tratto di acquedotto","No","B7","B7.1",0,"",null,"Porlezza",null,"Progetto esecutivo",2016,"-","-","-","-","-","-","-",null,null,null,null,null,null,null,null,37875,30000,0,0,0,0,0,0,{"$f":"SUM(AC251+AE251+AG251+AI251)","v":37875},{"$f":"SUM(AD251+AF251+AH251+AJ251)","v":30000}]
[null,"203.13189.1","Porlezza_RETI FOGNARIE - Mappatura / Ricerche perdite / Studi","Sì","K1","K1.1",476635,"",null,"Porlezza","NO","",2016,"-","-",100,"-","-","-","-",null,null,null,null,null,null,null,null,9750,0,0,0,0,0,0,0,9750,0]
[null,"200.13192.1","Allacciamenti alla rete fognaria","No","-","-",0,"",null,"Proserpio","NO","",2016,"-","-","-","-","-","-","-",null,null,null,null,null,null,null,null,0,42480,0,0,0,0,0,0,0,42480]
[null,"201.13192.1","Fognatura via Inarca - lotto 2","Sì","C1","C1.1",0,26,"rilevata","Proserpio","SI","Progetto esecutivo",2016,"-","-","-","-","-","-","-",null,null,null,null,null,null,null,null,0,135000,0,0,0,0,0,0,0,135000]
[null,"107.13193.1","Pusiano_RICERCA PERDITE / MAPPATURA RETE / STUDI","Sì","K1","K1.1",508066,"",null,"Pusiano","N.A.","",2016,"-","-",100,"-","-","-","-",null,null,null,null,null,null,null,null,9750,0,0,0,0,0,0,0,9750,0]
[null,"203.13193.1","Pusiano_RETI FOGNARIE - Mappatura / Ricerche perdite / Studi","Sì","K1","K1.1",476635,"",null,"Pusiano","NO","",2016,"-","-",100,"-","-","-","-",null,null,null,null,null,null,null,null,9750,0,0,0,0,0,0,0,9750,0]
[null,"101.13194.1","Recinzione ed adeguamento aree di rispetto pozzi e sorgenti","Sì","A1","A1.4",633,"",null,"Ramponio Verna","NO","Progetto preliminare",2016,"-","-","-","-","-","-","-",null,null,null,null,null,null,null,null,16290,0,0,0,0,0,0,0,16290,0]
[null,"107.13194.1","Ramponio Verna_RICERCA PERDITE / MAPPATURA RETE / STUDI","Sì","K1","K1.1",508066,"",null,"Ramponio Verna","N.A.","",2016,"-","-",100,"-","-","-","-",null,null,null,null,null,null,null,null,9750,0,0,0,0,0,0,0,9750,0]
[null,"203.13197.1","Rodero_RETI FOGNARIE - Mappatura / Ricerche perdite / Studi","Sì","K1","K1.1",476635,"",null,"Rodero","NO","",2016,"-","-",100,"-","-","-","-",null,null,null,null,null,null,null,null,9750,0,0,0,0,0,0,0,9750,0]
[null,"107.13199.1","Ronago_RICERCA PERDITE / MAPPATURA RETE / STUDI","Sì","K1","K1.1",508066,"",null,"Ronago","N.A.","",2016,"-","-",100,"-","-","-","-",null,null,null,null,null,null,null,null,9750,0,0,0,0,0,0,0,9750,0]
[null,"402.13199.1","ADEGUAMENTO DELL'IMPIANTO ALLE NORMATIVE DI SICUREZZA","Sì","D2","D2.2",0,"",null,"RONAGO","NO","Studio di fattibilità",2016,"-","-","-","-","-","-","-",null,null,null,null,null,null,null,null,85000,0,0,0,0,0,0,0,85000,0]
[null,"403.13199.2","FORMAZIONE DI UN COLLEGAMENTO FRA LA TESTA DEL LABIRINTO ED IL VECCHIO SEDIMENTATORE","No","D2","D2.9",0,"",null,"RONAGO","NO","Studio di fattibilità",2016,"-","-","100% giudizi Conformi / Regolamentari","-","-","-","-",null,null,null,null,null,null,null,null,20000,0,0,0,0,0,0,0,20000,0]
[null,"403.13199.1","ADEGUAMENTO TRATTAMENTO ACQUE DI PRIMA PIOGGIA","Sì","D2","D2.9",0,"",null,"RONAGO","NO","Progetto preliminare",2016,"-","-","100% giudizi Conformi / Regolamentari","-","-","-","-",null,null,null,null,null,null,null,null,50000,0,0,0,0,0,0,0,50000,0]
[null,"203.13199.1","Ronago_RETI FOGNARIE - Mappatura / Ricerche perdite / Studi","Sì","K1","K1.1",476635,"",null,"Ronago","NO","",2016,"-","-",100,"-","-","-","-",null,null,null,null,null,null,null,null,9750,0,0,0,0,0,0,0,9750,0]
[null,"107.13203.3","Sala Comacina_RICERCA PERDITE / MAPPATURA RETE / STUDI","Sì","K1","K1.1",508066,"",null,"Sala Comacina","N.A.","",2016,"-","-",100,"-","-","-","-",null,null,null,null,null,null,null,null,9750,0,0,0,0,0,0,0,9750,0]
[null,"107.13204.1","San Bartolomeo Val Cavargna_RICERCA PERDITE / MAPPATURA RETE / STUDI","Sì","K1","K1.1",508066,"",null,"San Bartolomeo Val Cavargna","N.A.","",2016,"-","-",100,"-","-","-","-",null,null,null,null,null,null,null,null,9750,0,0,0,0,0,0,0,9750,0]
[null,"203.13204.1","San Bartolomeo Val Cavargna_RETI FOGNARIE - Mappatura / Ricerche perdite / Studi","Sì","K1","K1.1",476635,"",null,"San Bartolomeo Val Cavargna","NO","",2016,"-","-",100,"-","-","-","-",null,null,null,null,null,null,null,null,9750,0,0,0,0,0,0,0,9750,0]
[null,"200.13205.1","Allacciamenti alla rete fognaria","No","-","-",0,"",null,"San Fedele Intelvi","NO","",2016,"-","-","-","-","-","-","-",null,null,null,null,null,null,null,null,0,160480,0,0,0,0,0,0,0,160480]
[null,"201.13205.1","disattivazione scarico n. 1 con realizzazione sfioratore di piena e tratti fognatura acque chiare e nere in via Loria, S. Liberata e Gaggione (FG01320501)","No","C1","C1.1",0,349,"rilevata","San Fedele Intelvi","NO","",2016,"-","-","-","-","-","-","-",null,null,null,null,null,null,null,null,942000,0,0,0,0,0,0,0,942000,0]
[null,"201.13205.2","Nuovo intervento per disattivazione terminale di scarico n. 2 con realizzazione di sfioratore di piena e tratto fognatura acque nere in via F.lli Ferrari (FG01320502)","No","C1","C1.1",0,319,"rilevata","San Fedele Intelvi","NO","",2016,"-","-","-","-","-","-","-",null,null,null,null,null,null,null,null,274750,0,0,0,0,0,0,0,274750,0]
[null,"201.13205.3","Lavori di realizzazione fognatura e tratto di acquedotto in via Provinciale (FG01320507)","Sì","C1","C1.1",0,62,"rilevata","San Fedele Intelvi","NO","",2016,"-","-","-","-","-","-","-",null,null,null,null,null,null,null,null,0,260000,0,0,0,0,0,0,0,260000]
[null,"107.13206.1","San Fermo della Battaglia_RICERCA PERDITE / MAPPATURA RETE / STUDI","Sì","K1","K1.1",508066,"",null,"San Fermo della Battaglia","N.A.","",2016,"-","-",100,"-","-","-","-",null,null,null,null,null,null,null,null,9750,0,0,0,0,0,0,0,9750,0]
[null,"203.13206.1","San Fermo della Battaglia_RETI FOGNARIE - Mappatura / Ricerche perdite / Studi","Sì","K1","K1.1",476635,"",null,"San Fermo della Battaglia","NO","",2016,"-","-",100,"-","-","-","-",null,null,null,null,null,null,null,null,9750,0,0,0,0,0,0,0,9750,0]
[null,"107.13207.1","San Nazzaro Val Cavargna_RICERCA PERDITE / MAPPATURA RETE / STUDI","Sì","K1","K1.1",508066,"",null,"San Nazzaro Val Cavargna","N.A.","",2016,"-","-",100,"-","-","-","-",null,null,null,null,null,null,null,null,9750,0,0,0,0,0,0,0,9750,0]
[null,"401.13207.1","Realizzazione fognatura in località Crevegno e Revolé","No","D1","D1.1",0,"",null,"San Nazzaro Val Cavargna","NO","",2016,"-","-",100,"-","-","-","-",null,null,null,null,null,null,null,null,34537.040000000001,149448.47,0,0,0,0,0,0,34537.040000000001,149448.47]
[null,"203.13207.1","San Nazzaro Val Cavargna_RETI FOGNARIE - Mappatura / Ricerche perdite / Studi - Agglomerato 1","Sì","K1","K1.1",476635,"",null,"San Nazzaro Val Cavargna","NO","",2016,"-","-",100,"-","-","-","-",null,null,null,null,null,null,null,null,5254.28,0,0,0,0,0,0,0,5254.28,0]
[null,"203.13207.2","San Nazzaro Val Cavargna_RETI FOGNARIE - Mappatura / Ricerche perdite / Studi - Agglomerato 2","Sì","K1","K1.1",476635,"",null,"San Nazzaro Val Cavargna","NO","",2016,"-","-",100,"-","-","-","-",null,null,null,null,null,null,null,null,4495.7299999999996,0,0,0,0,0,0,0,4495.7299999999996,0]
[null,"107.13248.1","San Siro_RICERCA PERDITE / MAPPATURA RETE / STUDI","Sì","K1","K1.1",508066,"",null,"San Siro","N.A.","",2016,"-","-",100,"-","-","-","-",null,null,null,null,null,null,null,null,9750,0,0,0,0,0,0,0,9750,0]
[null,"107.13211.1","Schignano_RICERCA PERDITE / MAPPATURA RETE / STUDI","Sì","K1","K1.1",508066,"",null,"Schignano","N.A.","",2016,"-","-",100,"-","-","-","-",null,null,null,null,null,null,null,null,9750,0,0,0,0,0,0,0,9750,0]
[null,"201.13211.1","Realizzazione nuovo impianto fraz. Vesbio, Lotto 2","Sì","C1","C1.1",0,40,"rilevata","Schignano","NO","Progetto preliminare",2016,"-","-","-","-","-","-","-",null,null,null,null,null,null,null,null,250000,0,0,0,0,0,0,0,250000,0]
[null,"201.13211.2","Realizzazione nuovo impianto fraz. Santa Maria, lotto 3","Sì","C1","C1.1",0,60,"rilevata","Schignano",null,"Progetto esecutivo",2016,"-","-","-","-","-","-","-",null,null,null,null,null,null,null,null,106840.38,68159.62,0,0,0,0,0,0,106840.38,68159.62]
[null,"203.13211.1","Schignano_RETI FOGNARIE - Mappatura / Ricerche perdite / Studi","Sì","K1","K1.1",476635,"",null,"Schignano","NO","",2016,"-","-",100,"-","-","-","-",null,null,null,null,null,null,null,null,9750,0,0,0,0,0,0,0,9750,0]
[null,"107.13212.1","Mappatura rete idrica piano di ricerca perdite","Sì","K1","K1.1",508066,"",null,"Senna Comasco","N.A.","Studio di fattibilità",2016,"-","-",100,"-","-","-","-",null,null,null,null,null,null,null,null,15600,0,0,0,0,0,0,0,15600,0]
[null,"203.13212.1","Senna Comasco_RETI FOGNARIE - Mappatura / Ricerche perdite / Studi","Sì","K1","K1.1",476635,"",null,"Senna Comasco","NO","",2016,"-","-",100,"-","-","-","-",null,null,null,null,null,null,null,null,9750,0,0,0,0,0,0,0,9750,0]
[null,"102.13215.1","INTERVENTO PER RIATTIVAZIONE DEL  NUOVO POZZO DI VIA CESARE BATTISTI (COD. POZZ: 0132150004) ATTUALMENTE NON FUNZIONANTE PER LA PRESENZA DI LIMO FINISSIMO A CAUSA DI UN PROBABILE CEDIMENTO NELLA FALDA.  ","No","A1","A1.1",0,"",null,"Solbiate","N.A.","Progetto esecutivo",2016,"-","-",0,"-","-","-","-",null,null,null,null,null,null,null,null,30000,0,0,0,0,0,0,0,30000,0]
[null,"105.13215.1","MANUTENZIONE PRESSO L'IMPIANTO AL BIOSSIDO - ANOMALIA A DUE SENSORI ","No","P2","P2.1",0,"",null,"Solbiate","NO","",2016,"-","-","100% giudizi almeno DISCRETO","-","-","-","-",null,null,null,null,null,null,null,null,3000,0,0,0,0,0,0,0,3000,0]
[null,"107.13216.1","Sorico_RICERCA PERDITE / MAPPATURA RETE / STUDI","Sì","K1","K1.1",508066,"",null,"Sorico","N.A.","",2016,"-","-",100,"-","-","-","-",null,null,null,null,null,null,null,null,9750,0,0,0,0,0,0,0,9750,0]
[null,"203.13216.1","Sorico_RETI FOGNARIE - Mappatura / Ricerche perdite / Studi","Sì","K1","K1.1",476635,"",null,"Sorico","NO","",2016,"-","-",100,"-","-","-","-",null,null,null,null,null,null,null,null,9750,0,0,0,0,0,0,0,9750,0]
[null,"203.13217.1","Sormano_RETI FOGNARIE - Mappatura / Ricerche perdite / Studi","Sì","K1","K1.1",476635,"",null,"Sormano","NO","",2016,"-","-",100,"-","-","-","-",null,null,null,null,null,null,null,null,9750,0,0,0,0,0,0,0,9750,0]
[null,"107.13218.1","Stazzona_RICERCA PERDITE / MAPPATURA RETE / STUDI","Sì","K1","K1.1",508066,"",null,"Stazzona","N.A.","",2016,"-","-",100,"-","-","-","-",null,null,null,null,null,null,null,null,9750,0,0,0,0,0,0,0,9750,0]
[null,"107.13222.1","Tavernerio_RICERCA PERDITE / MAPPATURA RETE / STUDI","Sì","K1","K1.1",508066,"",null,"Tavernerio","N.A.","",2016,"-","-",100,"-","-","-","-",null,null,null,null,null,null,null,null,9750,0,0,0,0,0,0,0,9750,0]
[null,"201.13223.1","Fornitura e posa di tre trituratori per gli allacciamenti al collettore sub lacuale nelle seguenti zone: piazza Casartelli, piazza Braga, piazza S.Giovanni","No","C1","C1.1",0,"",null,"Torno","NO","Progetto preliminare",2016,"-","-","-","-","-","-","-",null,null,null,null,null,null,null,null,75000,0,0,0,0,0,0,0,75000,0]
[null,"105.13252.1","Interventi potabilizzazione bacino  \"Fula\" e bacino \"Acquafredda\" mediante dosaggio cloro","No","P2","P2.1",0,"",null,"Tremezzina","NO","Progetto preliminare",2016,"-","-","100% giudizi almeno DISCRETO","-","-","-","-",null,null,null,null,null,null,null,null,15000,0,0,0,0,0,0,0,15000,0]
[null,"110.13252.1","Nuova condotta premente adduttrice, in Località Lenno, dal pozzo di Sant'Andrea al serbatoio Campagnola","Sì","B4","B4.1",10044,"",null,"Tremezzina","NO","Progetto esecutivo",2016,"-","-","-","-","-","-","-",null,null,null,null,null,null,null,null,0,550000,0,0,0,0,0,0,0,550000]
[null,"200.13252.1","Allacciamenti alla rete fognaria","No","-","-",0,"",null,"Tremezzina","NO","",2016,"-","-","-","-","-","-","-",null,null,null,null,null,null,null,null,0,21240,0,0,0,0,0,0,0,21240]
[null,"201.13252.1","Completamento della rete di drenaggio urbano lungo la via Diaz","Sì","C1","C1.1",0,22,"rilevata","Tremezzina",null,"Progetto esecutivo",2016,"-","-","-","-","-","-","-",null,null,null,null,null,null,null,null,146204.76,41795.24,0,0,0,0,0,0,146204.76,41795.24]
[null,"202.13252.1","Sistemazione rete fognaria in località Ossuccio/Ospedaletto (2° lotto)","Sì","C2","C2.1",0,"",null,"Tremezzina",null,"Progetto esecutivo",2016,"-","-","-","-","-","-","-",null,null,null,null,null,null,null,null,800,48200,0,0,0,0,0,0,800,48200]
[null,"107.13227.1","Turate_RICERCA PERDITE / MAPPATURA RETE / STUDI","Sì","K1","K1.1",508066,"",null,"Turate","N.A.","",2016,"-","-",100,"-","-","-","-",null,null,null,null,null,null,null,null,9750,0,0,0,0,0,0,0,9750,0]
[null,"107.13233.1","Val Rezzo_RICERCA PERDITE / MAPPATURA RETE / STUDI","Sì","K1","K1.1",508066,"",null,"Val Rezzo","N.A.","",2016,"-","-",100,"-","-","-","-",null,null,null,null,null,null,null,null,9750,0,0,0,0,0,0,0,9750,0]
[null,"111.13229.1","Valbrona_Serbatoio  Candalino: manutenzione straordinaria","No","B8","B8.1",0,"",null,"Valbrona","NO","Studio di fattibilità",2016,"-","-","-","-","-","-","-",null,null,null,null,null,null,null,null,35000,0,0,0,0,0,0,0,35000,0]
[null,"203.13229.1","Valbrona_RETI FOGNARIE - Mappatura / Ricerche perdite / Studi","Sì","K1","K1.1",476635,"",null,"Valbrona","NO","",2016,"-","-",100,"-","-","-","-",null,null,null,null,null,null,null,null,9750,0,0,0,0,0,0,0,9750,0]
[null,"100.13234.1","Allacciamenti alla rete acquedottistica","No","-","-",0,"",null,"Valsolda","NO","",2016,"-","-","-","-","-","-","-",null,null,null,null,null,null,null,null,0,222400,0,0,0,0,0,0,0,222400]
[null,"107.13234.1","Valsolda_RICERCA PERDITE / MAPPATURA RETE / STUDI","Sì","K1","K1.1",508066,"",null,"Valsolda","N.A.","",2016,"-","-",100,"-","-","-","-",null,null,null,null,null,null,null,null,9750,0,0,0,0,0,0,0,9750,0]
[null,"200.13234.1","Allacciamenti alla rete fognaria","No","-","-",0,"",null,"Valsolda","NO","",2016,"-","-","-","-","-","-","-",null,null,null,null,null,null,null,null,0,328040,0,0,0,0,0,0,0,328040]
[null,"201.13234.1","Realizzazione di fognatura in frazione Dasio e rimozione dello scarico in ambiente","No","C1","C1.1",0,20,"rilevata","Valsolda","NO","Progetto preliminare",2016,"-","-","-","-","-","-","-",null,null,null,null,null,null,null,null,120173.72,91711.23,0,0,0,0,0,0,120173.72,91711.23]
[null,"201.13234.2","Collettamento fognario Cressogno - Caravina lungo la SS 340","No","C1","C1.1",0,328,"rilevata","Valsolda","NO","Progetto preliminare",2016,"-","-","-","-","-","-","-",null,null,null,null,null,null,null,null,129759.08,186176.23,0,0,0,0,0,0,129759.08,186176.23]
[null,"203.13234.1","Valsolda_RETI FOGNARIE - Mappatura / Ricerche perdite / Studi","Sì","K1","K1.1",476635,"",null,"Valsolda","NO","",2016,"-","-",100,"-","-","-","-",null,null,null,null,null,null,null,null,9750,0,0,0,0,0,0,0,9750,0]
[null,"107.13236.1","Veleso_RICERCA PERDITE / MAPPATURA RETE / STUDI","Sì","K1","K1.1",508066,"",null,"Veleso","N.A.","",2016,"-","-",100,"-","-","-","-",null,null,null,null,null,null,null,null,9750,0,0,0,0,0,0,0,9750,0]
[null,"107.13238.1","Veniano_RICERCA PERDITE / MAPPATURA RETE / STUDI","Sì","K1","K1.1",508066,"",null,"Veniano","N.A.","",2016,"-","-",100,"-","-","-","-",null,null,null,null,null,null,null,null,9750,0,0,0,0,0,0,0,9750,0]
[null,"107.13239.1","Vercana_RICERCA PERDITE / MAPPATURA RETE / STUDI","Sì","K1","K1.1",508066,"",null,"Vercana","N.A.","",2016,"-","-",100,"-","-","-","-",null,null,null,null,null,null,null,null,9750,0,0,0,0,0,0,0,9750,0]
[null,"107.13242.1","Mappatura rete idrica  piano di ricerca perdite","Sì","K1","K1.1",508066,"",null,"Vertemate con Minoprio","N.A.","Studio di fattibilità",2016,"-","-",100,"-","-","-","-",null,null,null,null,null,null,null,null,19500,0,0,0,0,0,0,0,19500,0]
[null,"107.13245.1","Mappatura rete idrica piano di ricerca perdite","Sì","K1","K1.1",508066,"",null,"Villa Guardia","N.A.","Studio di fattibilità",2016,"-","-",100,"-","-","-","-",null,null,null,null,null,null,null,null,40000,0,0,0,0,0,0,0,40000,0]
[null,"107.13246.1","Zelbio_RICERCA PERDITE / MAPPATURA RETE / STUDI","Sì","K1","K1.1",508066,"",null,"Zelbio","N.A.","",2016,"-","-",100,"-","-","-","-",null,null,null,null,null,null,null,null,9750,0,0,0,0,0,0,0,9750,0]
[null,"203.13246.1","Zelbio_RETI FOGNARIE - Mappatura / Ricerche perdite / Studi","Sì","K1","K1.1",476635,"",null,"Zelbio","NO","",2016,"-","-",100,"-","-","-","-",null,null,null,null,null,null,null,null,9750,0,0,0,0,0,0,0,9750,0]
[null,"100.13003.1","Allacciamenti alla rete acquedottistica","No","-","-",0,"",null,"Albavilla","NO","",2017,"-","-","-","-","-","-","-",null,null,null,null,null,null,null,null,0,0,0,76800,0,0,0,0,{"$f":"SUM(AC315+AE315+AG315+AI315)","v":0},{"$f":"SUM(AD315+AF315+AH315+AJ315)","v":76800}]
[null,"200.13003.1","Allacciamenti alla rete fognaria","No","-","-",0,"",null,"Albavilla","NO","",2017,"-","-","-","-","-","-","-",null,null,null,null,null,null,null,null,0,0,0,113280,0,0,0,0,0,113280]
[null,"201.13041.2","Completamento fognatura via Saruggia, a sud SP 639","No","C1","C1.1",0,40,"rilevata","Albavilla","NO","",2017,"-","-","-","-","-","-","-",null,null,null,null,null,null,null,null,0,0,150000,0,0,0,0,0,150000,0]
[null,"202.13003.2","Albavilla_RETI FOGNARIE - manutenzione straordinaria (LOTTO 1) - AGGLOMERATO 2","No","C2","C2.1",0,"",null,"Albavilla","NO","",2017,"-","-","-","-","-","-","-",null,null,null,null,null,null,null,null,0,0,24345.8,0,0,0,0,0,24345.8,0]
[null,"110.13004.1","Rifacimento e potenziamento tratto rete di acquedotto comunale in via della Repubblica.","Sì","B4","B4.1",10044,"",null,"ALBESE CON CASSANO","NO","Progetto preliminare",2017,"-","-","-","-","-","-","-",null,null,null,null,null,null,null,null,0,0,32500,0,0,0,0,0,32500,0]
[null,"205.13004.1","Albese con Cassano_SCARICATORI DI PIENA - manutenzione straordinaria (LOTTO 1)","No","C4","C4.2",216510,"",null,"Albese con Cassano","NO","",2017,"-","-","-","1 episodio/anno per scolmatore","-","-","-",null,null,null,null,null,null,null,null,0,0,11775,0,0,0,0,0,11775,0]
[null,"107.13005.3","Albiolo_RICERCA PERDITE / MAPPATURA RETE / STUDI (ulteriore int. pianificati non prioritari)","Sì","K1","K1.1",508066,"",null,"Albiolo","N.A.","",2017,"-","-","-",100,"-","-","-",null,null,null,null,null,null,null,null,0,0,9750,0,0,0,0,0,9750,0]
[null,"202.13005.1","Albiolo_RETI FOGNARIE - manutenzione straordinaria (LOTTO 1)","No","C2","C2.1",0,"",null,"Albiolo","NO","",2017,"-","-","-","-","-","-","-",null,null,null,null,null,null,null,null,0,0,12055.25,0,0,0,0,0,12055.25,0]
[null,"207.13005.1","Albiolo_STAZIONI DI SOLLEVAMENTO - manutenzione straordinaria (LOTTO 1)","No","C2","C2.3",4659,"",null,"Albiolo","NO","",2017,"-","-","-","-","-","-","-",null,null,null,null,null,null,null,null,0,0,8007,0,0,0,0,0,8007,0]
[null,"207.13006.1","Alserio_STAZIONI DI SOLLEVAMENTO - manutenzione straordinaria (prioritario con attivazione immediata)","No","C2","C2.3",4659,"",null,"Alserio","NO","",2017,"-","-","-","-","-","-","-",null,null,null,null,null,null,null,null,0,0,4003.5,0,0,0,0,0,4003.5,0]
[null,"202.13007.1","Alzate Brianza_RETI FOGNARIE - manutenzione straordinaria (LOTTO 1) - AGGLOMERATO 2","No","C2","C2.1",0,"",null,"Alzate Brianza","NO","",2017,"-","-","-","-","-","-","-",null,null,null,null,null,null,null,null,0,0,3738.16,0,0,0,0,0,3738.16,0]
[null,"204.13007.1","Alzate Brianza_RETI FOGNARIE - Separazione reti miste - nuove opere (LOTTO 1) - AGGLOMERATO 1","No","C4","C4.1",0,"",null,"Alzate Brianza","NO","",2017,"-","-","-","massimo 1 episodio ogni 2 km di rete fognaria presenti nel Comune","-","-","-",null,null,null,null,null,null,null,null,0,0,19872.16,0,0,0,0,0,19872.16,0]
[null,"204.13007.2","Alzate Brianza_RETI FOGNARIE - Separazione reti miste - nuove opere (LOTTO 1) - AGGLOMERATO 2","No","C4","C4.1",0,"",null,"Alzate Brianza","NO","",2017,"-","-","-","massimo 1 episodio ogni 2 km di rete fognaria presenti nel Comune","-","-","-",null,null,null,null,null,null,null,null,0,0,10159.82,0,0,0,0,0,10159.82,0]
[null,"102.13009.1","chiusura e sigillatura pozzo Cavognetto","No","A1","A1.1",0,"",null,"Anzano del Parco","NO","Studio di fattibilità",2017,"-","-","-",0,"-","-","-",null,null,null,null,null,null,null,null,0,0,10000,0,0,0,0,0,10000,0]
[null,"102.13009.2","messa in sicurezza ai sensi del D.Lgs. 81/08 degli impianti elettrici a servizio dei pozzi e delle reti","No","A1","A1.1",0,"",null,"Anzano del Parco","NO","",2017,"-","-","-",0,"-","-","-",null,null,null,null,null,null,null,null,0,0,10000,0,0,0,0,0,10000,0]
[null,"107.13009.3","Anzano del Parco_RICERCA PERDITE / MAPPATURA RETE / STUDI (ulteriore int. pianificati non prioritari)","Sì","K1","K1.1",508066,"",null,"Anzano del Parco","N.A.","",2017,"-","-","-",100,"-","-","-",null,null,null,null,null,null,null,null,0,0,1560,0,0,0,0,0,1560,0]
[null,"111.13009.1","MESSA IN SICUREZZA DEGLI IMPIANTI DI SOLLEVAMENTO E ACCUMULO ESISTENTI","No","B8","B8.1",0,"",null,"Anzano del Parco","N.A.","Progetto esecutivo",2017,"-","-","-","-","-","-","-",null,null,null,null,null,null,null,null,0,0,13562.14,0,0,0,0,0,13562.14,0]
[null,"107.13010.3","Appiano Gentile_RICERCA PERDITE / MAPPATURA RETE / STUDI (ulteriore int. pianificati non prioritari)","Sì","K1","K1.1",508066,"",null,"Appiano Gentile","N.A.","",2017,"-","-","-",100,"-","-","-",null,null,null,null,null,null,null,null,0,0,9750,0,0,0,0,0,9750,0]
[null,"205.13010.1","Appiano Gentile_SCARICATORI DI PIENA - manutenzione straordinaria (prioritario con attivazione immediata) - AGGLOMERATO 1","No","C4","C4.2",216510,"",null,"Appiano Gentile","NO","",2017,"-","-","-","1 episodio/anno per scolmatore","-","-","-",null,null,null,null,null,null,null,null,0,0,15700,0,0,0,0,0,15700,0]
[null,"206.13010.1","Appiano Gentile_SCARICATORI DI PIENA - nuove opere (inserimento / adeguamento paratoie) (prioritario con attivazione immediata) - AGGLOMERATO 1","No","C4","C4.2",11407,"",null,"Appiano Gentile","NO","",2017,"-","-","-","1 episodio/anno per scolmatore","-","-","-",null,null,null,null,null,null,null,null,0,0,5068,0,0,0,0,0,5068,0]
[null,"105.13011.1","Argegno_POTABILIZZATORI - adeguamento","Sì","P2","P2.1",0,"",null,"Argegno","NO","",2017,"-","-","-","100% giudizi almeno DISCRETO","-","-","-",null,null,null,null,null,null,null,null,0,0,30000,0,0,0,0,0,30000,0]
[null,"203.13011.1","Argegno_RETI FOGNARIE - Mappatura / Ricerche perdite / Studi","Sì","K1","K1.1",476635,"",null,"Argegno","NO","",2017,"-","-","-",100,"-","-","-",null,null,null,null,null,null,null,null,0,0,9750,0,0,0,0,0,9750,0]
[null,"204.13011.1","SEPARAZIONE RETI MISTE - NUOVE OPERE - PIAZZA ROMA E PIAZZA RIMEMBRANZE","No","C4","C4.1",0,"",null,"Argegno","NO","Progetto preliminare",2017,"-","-","-","massimo 1 episodio ogni 2 km di rete fognaria presenti nel Comune","-","-","-",null,null,null,null,null,null,null,null,0,0,210000,0,0,0,0,0,210000,0]
[null,"107.13012.3","Arosio_RICERCA PERDITE / MAPPATURA RETE / STUDI (ulteriore int. pianificati non prioritari)","Sì","K1","K1.1",508066,"",null,"Arosio","N.A.","",2017,"-","-","-",100,"-","-","-",null,null,null,null,null,null,null,null,0,0,9750,0,0,0,0,0,9750,0]
[null,"302.13012.1","Adeguamento fognatura in piazza Montello e 1° tratto di via Oberdan","No","C2","C2.1",0,"",null,"Arosio","NO","Progetto definitivo",2017,"-","-","-","-","-","-","-",null,null,null,null,null,null,null,null,0,0,850000,0,0,0,0,0,850000,0]
[null,"304.13012.1","Completamento collettore intercomunale Carugo-Alzate (Lotto finale)","Sì","C1","C1.1",0,"",null,"Arosio","NO","Studio di fattibilità",2017,"-","-","-","-","-","-","-",null,null,null,null,null,null,null,null,0,0,850000,0,0,0,0,0,850000,0]
[null,"202.13012.1","Arosio_RETI FOGNARIE - manutenzione straordinaria (LOTTO 1) - AGGLOMERATO 2","No","C2","C2.1",0,"",null,"Arosio","NO","",2017,"-","-","-","-","-","-","-",null,null,null,null,null,null,null,null,0,0,457.91,0,0,0,0,0,457.91,0]
[null,"202.13012.1","Arosio_RETI FOGNARIE - manutenzione straordinaria (LOTTO 1) - AGGLOMERATO 3","No","C2","C2.1",0,"",null,"Arosio","NO","",2017,"-","-","-","-","-","-","-",null,null,null,null,null,null,null,null,0,0,110.96,0,0,0,0,0,110.96,0]
[null,"110.13013.1","Rifacimento tratto acquedotto centro storico - I Lotto via Matteotti tratto da via Prato a p.zza Mazzini","No","B4","B4.1",10044,"",null,"Asso","NO","Progetto preliminare",2017,"-","-","-","-","-","-","-",null,null,null,null,null,null,null,null,0,0,50000,0,0,0,0,0,50000,0]
[null,"107.13013.1","Asso_RICERCA PERDITE / MAPPATURA RETE / STUDI","Sì","K1","K1.1",508066,"",null,"Asso","N.A.","",2017,"-","-","-",100,"-","-","-",null,null,null,null,null,null,null,null,0,0,9750,0,0,0,0,0,9750,0]
[null,"202.13013.1","NUOVO INTERVENTO  URGENTE DI RIQUALIFICAZIONE E ADEGUAMENTO FOGNATURA IN LOC. GEMU' CON DISMISSIONE POZZI PERDENTI","Sì","C2","C2.1",0,"",null,"Asso","NO","Progetto preliminare",2017,"-","-","-","-","-","-","-",null,null,null,null,null,null,null,null,0,0,50000,0,0,0,0,0,50000,0]
[null,"107.13015.1","Barni_RICERCA PERDITE / MAPPATURA RETE / STUDI","Sì","K1","K1.1",508066,"",null,"Barni","N.A.","",2017,"-","-","-",100,"-","-","-",null,null,null,null,null,null,null,null,0,0,9750,0,0,0,0,0,9750,0]
[null,"104.13019.1","Realizzazione nuovo pozzo in via Beneficenza e raccordo delle vie limitrofe al parco di San Giovanni","No","A1","A1.1",60449,"",null,"Bellagio","NO","",2017,"-","-","-",0,"-","-","-",null,null,null,null,null,null,null,null,0,0,126250,100000,0,0,0,0,126250,100000]
[null,"107.13019.1","Bellagio_RICERCA PERDITE / MAPPATURA RETE / STUDI","Sì","K1","K1.1",508066,"",null,"Bellagio","N.A.","",2017,"-","-","-",100,"-","-","-",null,null,null,null,null,null,null,null,0,0,9750,0,0,0,0,0,9750,0]
[null,"202.13019.1","Bellagio_RETI FOGNARIE - manutenzione straordinaria (LOTTO 1) - AGGLOMERATO 1","No","C2","C2.1",0,"",null,"Bellagio","NO","",2017,"-","-","-","-","-","-","-",null,null,null,null,null,null,null,null,0,0,16285.91,0,0,0,0,0,16285.91,0]
[null,"202.13019.2","Bellagio_RETI FOGNARIE - manutenzione straordinaria (LOTTO 1) - AGGLOMERATO 2","No","C2","C2.1",0,"",null,"Bellagio","NO","",2017,"-","-","-","-","-","-","-",null,null,null,null,null,null,null,null,0,0,2365.1,0,0,0,0,0,2365.1,0]
[null,"202.13019.3","Bellagio_RETI FOGNARIE - manutenzione straordinaria (LOTTO 1) - AGGLOMERATO 3","No","C2","C2.1",0,"",null,"Bellagio","NO","",2017,"-","-","-","-","-","-","-",null,null,null,null,null,null,null,null,0,0,3406.95,0,0,0,0,0,3406.95,0]
[null,"203.13019.1","Bellagio_RETI FOGNARIE - Mappatura / Ricerche perdite / Studi - AGGLOMERATO 1","Sì","K1","K1.1",476635,"",null,"Bellagio","NO","",2017,"-","-","-",100,"-","-","-",null,null,null,null,null,null,null,null,0,0,6827.93,0,0,0,0,0,6827.93,0]
[null,"203.13019.2","Bellagio_RETI FOGNARIE - Mappatura / Ricerche perdite / Studi - AGGLOMERATO 2","Sì","K1","K1.1",476635,"",null,"Bellagio","NO","",2017,"-","-","-",100,"-","-","-",null,null,null,null,null,null,null,null,0,0,991.58,0,0,0,0,0,991.58,0]
[null,"203.13019.3","Bellagio_RETI FOGNARIE - Mappatura / Ricerche perdite / Studi - AGGLOMERATO 3","Sì","K1","K1.1",476635,"",null,"Bellagio","NO","",2017,"-","-","-",100,"-","-","-",null,null,null,null,null,null,null,null,0,0,1428.38,0,0,0,0,0,1428.38,0]
[null,"107.13021.1","Bene Lario_RICERCA PERDITE / MAPPATURA RETE / STUDI","Sì","K1","K1.1",508066,"",null,"Bene Lario","N.A.","",2017,"-","-","-",100,"-","-","-",null,null,null,null,null,null,null,null,0,0,9750,0,0,0,0,0,9750,0]
[null,"203.13021.1","Bene Lario_RETI FOGNARIE - Mappatura / Ricerche perdite / Studi","Sì","K1","K1.1",476635,"",null,"Bene Lario","NO","",2017,"-","-","-",100,"-","-","-",null,null,null,null,null,null,null,null,0,0,9750,0,0,0,0,0,9750,0]
[null,"202.13022.1","Interventi di sistemazione e potenziamento reticolo did renaggio urbano Via IV Novembre- Via Vernos in Comune di Beregazzo con Figliaro","No","C2","C2.1",0,"",null,"Beregazzo con Figliaro","NO","",2017,"-","-","-","-","-","-","-",null,null,null,null,null,null,null,null,0,0,200000,0,0,0,0,0,200000,0]
[null,"204.13022.1","Beregazzo con Figliaro_RETI FOGNARIE - Separazione reti miste - nuove opere (LOTTO 1)","No","C4","C4.1",0,"",null,"Beregazzo con Figliaro","NO","",2017,"-","-","-","massimo 1 episodio ogni 2 km di rete fognaria presenti nel Comune","-","-","-",null,null,null,null,null,null,null,null,0,0,17657,0,0,0,0,0,17657,0]
[null,"205.13022.1","Beregazzo con Figliaro_SCARICATORI DI PIENA - manutenzione straordinaria (prioritario con attivazione immediata)","No","C4","C4.2",216510,"",null,"Beregazzo con Figliaro","NO","",2017,"-","-","-","1 episodio/anno per scolmatore","-","-","-",null,null,null,null,null,null,null,null,0,0,3925,0,0,0,0,0,3925,0]
[null,"107.13023.1","Binago_RICERCA PERDITE / MAPPATURA RETE / STUDI","Sì","K1","K1.1",508066,"",null,"Binago","N.A.","",2017,"-","-","-",100,"-","-","-",null,null,null,null,null,null,null,null,0,0,9750,0,0,0,0,0,9750,0]
[null,"107.13024.1","Bizzarone_RICERCA PERDITE / MAPPATURA RETE / STUDI","Sì","K1","K1.1",508066,"",null,"Bizzarone","N.A.","",2017,"-","-","-",100,"-","-","-",null,null,null,null,null,null,null,null,0,0,9750,0,0,0,0,0,9750,0]
[null,"204.13024.1","Bizzarone_RETI FOGNARIE - Separazione reti miste - nuove opere (LOTTO 1)","No","C4","C4.1",0,"",null,"Bizzarone","NO","",2017,"-","-","-","massimo 1 episodio ogni 2 km di rete fognaria presenti nel Comune","-","-","-",null,null,null,null,null,null,null,null,0,0,12666.83,0,0,0,0,0,12666.83,0]
[null,"206.13024.1","Bizzarone_SCARICATORI DI PIENA - nuove opere (inserimento / adeguamento paratoie) (prioritario con attivazione immediata)","No","C4","C4.2",11407,"",null,"Bizzarone","NO","",2017,"-","-","-","1 episodio/anno per scolmatore","-","-","-",null,null,null,null,null,null,null,null,0,0,1267,0,0,0,0,0,1267,0]
[null,"202.13025.1","Blessagno_RETI FOGNARIE - manutenzione straordinaria (LOTTO 1)","No","C2","C2.1",0,"",null,"Blessagno","NO","",2017,"-","-","-","-","-","-","-",null,null,null,null,null,null,null,null,0,0,545.89,0,0,0,0,0,545.89,0]
[null,"107.13026.1","Blevio_RICERCA PERDITE / MAPPATURA RETE / STUDI","Sì","K1","K1.1",508066,"",null,"Blevio","N.A.","",2017,"-","-","-",100,"-","-","-",null,null,null,null,null,null,null,null,0,0,9750,0,0,0,0,0,9750,0]
[null,"107.13028.1","Bregnano_RICERCA PERDITE / MAPPATURA RETE / STUDI","Sì","K1","K1.1",508066,"",null,"Bregnano","N.A.","",2017,"-","-","-",100,"-","-","-",null,null,null,null,null,null,null,null,0,0,9750,0,0,0,0,0,9750,0]
[null,"202.13028.1","condotte in fascia di rispetto pozzo via Indipendenza - Intervento 1","Sì","C2","C2.1",0,"",null,"Bregnano","NO","Progetto preliminare",2017,"-","-","-","-","-","-","-",null,null,null,null,null,null,null,null,0,0,28384.17,0,0,0,0,0,28384.17,0]
[null,"203.13028.1","Bregnano_RETI FOGNARIE - Mappatura / Ricerche perdite / Studi","Sì","K1","K1.1",476635,"",null,"Bregnano","NO","",2017,"-","-","-",100,"-","-","-",null,null,null,null,null,null,null,null,0,0,9750,0,0,0,0,0,9750,0]
[null,"107.13029.1","Brenna_RICERCA PERDITE / MAPPATURA RETE / STUDI","Sì","K1","K1.1",508066,"",null,"Brenna","N.A.","",2017,"-","-","-",100,"-","-","-",null,null,null,null,null,null,null,null,0,0,3900,0,0,0,0,0,3900,0]
[null,"107.13029.2","CENSIMENTO RETE E DERIVAZIONI","Sì","K1","K1.1",508066,"",null,"BRENNA","N.A.","",2017,"-","-","-",100,"-","-","-",null,null,null,null,null,null,null,null,0,0,5850,0,0,0,0,0,5850,0]
[null,"202.13029.1","SOSTITUZIONE TRATTO DI FOGNATURA MISTA IN VIA KENNEDY FRAZIONE OLGELASCA","Sì","C2","C2.1",0,"",null,"Brenna","NO","Studio di fattibilità",2017,"-","-","-","-","-","-","-",null,null,null,null,null,null,null,null,0,0,170000,0,0,0,0,0,170000,0]
[null,"206.13029.1","Brenna_SCARICATORI DI PIENA - nuove opere (inserimento / adeguamento paratoie) (LOTTO 1)","No","C4","C4.2",11407,"",null,"Brenna","NO","",2017,"-","-","-","1 episodio/anno per scolmatore","-","-","-",null,null,null,null,null,null,null,null,0,0,5701.5,0,0,0,0,0,5701.5,0]
[null,"107.13030.1","Brienno_RICERCA PERDITE / MAPPATURA RETE / STUDI","Sì","K1","K1.1",508066,"",null,"Brienno","N.A.","",2017,"-","-","-",100,"-","-","-",null,null,null,null,null,null,null,null,0,0,9750,0,0,0,0,0,9750,0]
[null,"200.13032.1","Allacciamenti alla rete fognaria","No","-","-",0,"",null,"Brunate","NO","",2017,"-","-","-","-","-","-","-",null,null,null,null,null,null,null,null,0,0,0,84960,0,0,0,0,0,84960]
[null,"107.13034.1","Aggiornamento mappatura rete idrica  piano di ricerca perdite","Sì","K1","K1.1",508066,"",null,"Bulgarograsso","N.A.","Studio di fattibilità",2017,"-","-","-",100,"-","-","-",null,null,null,null,null,null,null,null,0,0,15600,0,0,0,0,0,15600,0]
[null,"403.13034.1","acquisto nuova centrifuga per la disidratazione fanghi depuratore di Bulgarograsso ","No","D2","D2.9",0,"",null,"Bulgarograsso","NO","",2017,"-","-","-","100% giudizi Conformi / Regolamentari","-","-","-",null,null,null,null,null,null,null,null,0,0,120000,0,0,0,0,0,120000,0]
[null,"302.13034.1","Rifacimento dorsale principale di fognatura del comune di Bulgarograsso ","No","C2","C2.1",0,"",null,"Bulgarograsso","NO","",2017,"-","-","-","-","-","-","-",null,null,null,null,null,null,null,null,0,0,1528148,0,0,0,0,0,1528148,0]
[null,"203.13034.1","Bulgarograsso_RETI FOGNARIE - Mappatura / Ricerche perdite / Studi","Sì","K1","K1.1",476635,"",null,"Bulgarograsso","NO","",2017,"-","-","-",100,"-","-","-",null,null,null,null,null,null,null,null,0,0,9750,0,0,0,0,0,9750,0]
[null,"105.13035.1","Adeguamento pozzo idropotabile di via Verdi - affidamento progettazione per l'individuazione sistema di abbattimento di manganese.","No","P2","P2.1",0,"",null,"Cabiate","NO","Studio di fattibilità",2017,"-","-","-","100% giudizi almeno DISCRETO","-","-","-",null,null,null,null,null,null,null,null,0,0,7800,0,0,0,0,0,{"$f":"SUM(AC379+AE379+AG379+AI379)","v":7800},{"$f":"SUM(AD379+AF379+AH379+AJ379)","v":0}]
[null,"105.13035.2","Adeguamento pozzo idropotabile di via Consorziale della Brughiera (via ai Ronchi) - affidamento progettazione per l'individuazione sistema di abbattimento di manganese.","No","P2","P2.1",0,"",null,"Cabiate","NO","Studio di fattibilità",2017,"-","-","-","100% giudizi almeno DISCRETO","-","-","-",null,null,null,null,null,null,null,null,0,0,7800,0,0,0,0,0,7800,0]
[null,"201.13035.1","COMPLETAMENTO FOGNATURA IN VIA KENNEDY","No","C1","C1.1",0,"",null,"Cabiate","NO","Progetto preliminare",2017,"-","-","-","-","-","-","-",null,null,null,null,null,null,null,null,0,0,160000,0,0,0,0,0,160000,0]
[null,"202.13035.1","RIFACIMENTO TRATTO DI FOGNATURA CON DEVIAZIONE DEL FLUSSO IN ALTRO RECAPITO DI COLLETTAMENTO","No","C2","C2.1",0,"",null,"Cabiate","NO","Studio di fattibilità",2017,"-","-","-","-","-","-","-",null,null,null,null,null,null,null,null,0,0,70000,0,0,0,0,0,70000,0]
[null,"203.13035.1","Cabiate_RETI FOGNARIE - Mappatura / Ricerche perdite / Studi","Sì","K1","K1.1",476635,"",null,"Cabiate","NO","",2017,"-","-","-",100,"-","-","-",null,null,null,null,null,null,null,null,0,0,9750,0,0,0,0,0,9750,0]
[null,"107.13036.1","Cadorago_RICERCA PERDITE / MAPPATURA RETE / STUDI","Sì","K1","K1.1",508066,"",null,"Cadorago","N.A.","",2017,"-","-","-",100,"-","-","-",null,null,null,null,null,null,null,null,0,0,9750,0,0,0,0,0,9750,0]
[null,"203.13036.1","Cadorago_RETI FOGNARIE - Mappatura / Ricerche perdite / Studi","Sì","K1","K1.1",476635,"",null,"Cadorago","NO","",2017,"-","-","-",100,"-","-","-",null,null,null,null,null,null,null,null,0,0,9750,0,0,0,0,0,9750,0]
[null,"205.13036.1","Cadorago_Adeguamento scolmatore Caslino (lotto 1)","No","C4","C4.2",216510,"",null,"Cadorago","NO","Studio di fattibilità",2017,"-","-","-","1 episodio/anno per scolmatore","-","-","-",null,null,null,null,null,null,null,null,0,0,19200,0,0,0,0,0,19200,0]
[null,"110.13037.1","Caglio_RETE DI DISTRIBUZIONE - manutenzione straordinaria / rifacimenti (LOTTO 1)","No","B4","B4.1",10044,"",null,"Caglio","NO","",2017,"-","-","-","-","-","-","-",null,null,null,null,null,null,null,null,0,0,4122.3599999999997,0,0,0,0,0,4122.3599999999997,0]
[null,"107.13037.1","Caglio_RICERCA PERDITE / MAPPATURA RETE / STUDI","Sì","K1","K1.1",508066,"",null,"Caglio","N.A.","",2017,"-","-","-",100,"-","-","-",null,null,null,null,null,null,null,null,0,0,9750,0,0,0,0,0,9750,0]
[null,"102.13038.1","PULIZIA E SPURGO DEI FILTRI DEL POZZO N. 2","No","A1","A1.1",0,"",null,"CAGNO","NO","",2017,"-","-","-",0,"-","-","-",null,null,null,null,null,null,null,null,0,0,11775,0,0,0,0,0,11775,0]
[null,"107.13038.1","Cagno_RICERCA PERDITE / MAPPATURA RETE / STUDI","Sì","K1","K1.1",508066,"",null,"Cagno","N.A.","",2017,"-","-","-",100,"-","-","-",null,null,null,null,null,null,null,null,0,0,9750,0,0,0,0,0,9750,0]
[null,"103.13041.1","INTERCONNESSIONE  TRA LE RETI IDRICHE DI  CANTU' E CARIMATE","No","A1","A1.1",549901,"",null,"Cantù","NO","Progetto preliminare",2017,"-","-","-",0,"-","-","-",null,null,null,null,null,null,null,null,0,0,70000,0,0,0,0,0,70000,0]
[null,"110.13041.1","SOSTITUZIONE RETE VIA  MARSALA","Sì","B4","B4.1",10044,"",null,"Cantù","NO","Studio di fattibilità",2017,"-","-","-","-","-","-","-",null,null,null,null,null,null,null,null,0,0,32028,0,0,0,0,0,32028,0]
[null,"108.13041.1","implementazione telecontrollo Centrale idrica di Cantù Asnago","No","K3","K3.1",0,"",null,"Cantù","N.A.","Progetto esecutivo",2017,"-","-","-","-","-","-","-",null,null,null,null,null,null,null,null,0,0,15000,0,0,0,0,0,15000,0]
[null,"203.13041.1","Cantù_RETI FOGNARIE - Mappatura / Ricerche perdite / Studi - Agglomerato 1","Sì","K1","K1.1",476635,"",null,"Cantù","NO","",2017,"-","-","-",100,"-","-","-",null,null,null,null,null,null,null,null,0,0,8156.85,0,0,0,0,0,8156.85,0]
[null,"203.13041.1","Cantù_RETI FOGNARIE - Mappatura / Ricerche perdite / Studi - Agglomerato 2","Sì","K1","K1.1",476635,"",null,"Cantù","NO","",2017,"-","-","-",100,"-","-","-",null,null,null,null,null,null,null,null,0,0,1593.15,0,0,0,0,0,1593.15,0]
[null,"101.13042.1","Canzo_Pozzi Ca' Nova Ca' Bianca","No","A1","A1.4",633,"",null,"Canzo","NO","Progetto preliminare",2017,"-","-","-","-","-","-","-",null,null,null,null,null,null,null,null,0,0,60000,0,0,0,0,0,60000,0]
[null,"110.13042.1","Canzo_manutenzione straordinaria reti - valvole di controllo pressione/portata","Sì","B4","B4.1",10044,"",null,"Canzo","NO","Progetto esecutivo",2017,"-","-","-","-","-","-","-",null,null,null,null,null,null,null,null,0,0,10000,0,0,0,0,0,10000,0]
[null,"110.13042.2","Canzo_manutenzione straordinaria reti_via Stoppani","No","B4","B4.1",10044,"",null,"Canzo","NO","Studio di fattibilità",2017,"-","-","-","-","-","-","-",null,null,null,null,null,null,null,null,0,0,135000,0,0,0,0,0,135000,0]
[null,"107.13042.1","Canzo_RICERCA PERDITE / MAPPATURA RETE / STUDI","Sì","K1","K1.1",508066,"",null,"Canzo","N.A.","",2017,"-","-","-",100,"-","-","-",null,null,null,null,null,null,null,null,0,0,9750,0,0,0,0,0,9750,0]
[null,"202.13042.1","Canzo_reti fognarie_via Stoppani","No","C2","C2.1",0,"",null,"Canzo",null,"Progetto esecutivo",2017,"-","-","-","-","-","-","-",null,null,null,null,null,null,null,null,0,0,90000,0,0,0,0,0,90000,0]
[null,"101.13043.1","Adeguamento pozzo Guastoni ","No","A1","A1.4",633,"",null,"Capiago Intimiano","NO","Studio di fattibilità",2017,"-","-","-","-","-","-","-",null,null,null,null,null,null,null,null,0,0,22625,0,0,0,0,0,22625,0]
[null,"103.13043.1","Raddoppio tubazione di collegamento tra centrale di rilancio Palazzetta al serbatoio Gariardo","No","A1","A1.1",549901,"",null,"Capiago Intimiano","NO","Progetto preliminare",2017,"-","-","-",0,"-","-","-",null,null,null,null,null,null,null,null,0,0,550000,0,0,0,0,0,550000,0]
[null,"110.13043.1","Rifacimento rete acquedotto camerette e allacciamenti  via Cacciatori delle Alpi ","Sì","B4","B4.1",10044,"",null,"Capiago Intimiano","NO","Progetto preliminare",2017,"-","-","-","-","-","-","-",null,null,null,null,null,null,null,null,0,0,19625,0,0,0,0,0,19625,0]
[null,"202.13044.1","Carate Urio_RETI FOGNARIE - manutenzione straordinaria (LOTTO 1)","No","C2","C2.1",0,"",null,"Carate Urio","NO","",2017,"-","-","-","-","-","-","-",null,null,null,null,null,null,null,null,0,0,1831.48,0,0,0,0,0,1831.48,0]
[null,"203.13044.1","Carate Urio_RETI FOGNARIE - Mappatura / Ricerche perdite / Studi (prioritario con attivazione immediata)","Sì","K1","K1.1",476635,"",null,"Carate Urio","NO","",2017,"-","-","-",100,"-","-","-",null,null,null,null,null,null,null,null,0,0,9750,0,0,0,0,0,9750,0]
[null,"204.13044.1","Realizzazione Nuovo tratto di fognatura - località Sassello (lotto 1)","No","C4","C4.1",0,"",null,"Carate Urio","NO","Progetto preliminare",2017,"-","-","-","massimo 1 episodio ogni 2 km di rete fognaria presenti nel Comune","-","-","-",null,null,null,null,null,null,null,null,0,0,304037.71000000002,22129.81,0,0,0,0,304037.71000000002,22129.81]
[null,"107.13045.1","Carbonate_RICERCA PERDITE / MAPPATURA RETE / STUDI","Sì","K1","K1.1",508066,"",null,"Carbonate","N.A.","",2017,"-","-","-",100,"-","-","-",null,null,null,null,null,null,null,null,0,0,9750,0,0,0,0,0,9750,0]
[null,"203.13045.1","Carbonate_RETI FOGNARIE - Mappatura / Ricerche perdite / Studi","Sì","K1","K1.1",476635,"",null,"Carbonate","NO","",2017,"-","-","-",100,"-","-","-",null,null,null,null,null,null,null,null,0,0,9750,0,0,0,0,0,9750,0]
[null,"204.13045.1","Carbonate_RETI FOGNARIE - Separazione reti miste - nuove opere (LOTTO 1)","No","C4","C4.1",0,"",null,"Carbonate","NO","",2017,"-","-","-","massimo 1 episodio ogni 2 km di rete fognaria presenti nel Comune","-","-","-",null,null,null,null,null,null,null,null,0,0,25831.87,0,0,0,0,0,25831.87,0]
[null,"110.13046.1","RISTRUTTURAZIONE E ADEGUAMENTO TECNOLOGICO CENTRALE IDRICA \"VALLE SEVESO\" - rifacimento adduzioni (LOTTO 1)","Sì","B4","B4.1",10044,"",null,"Carimate","NO","Studio di fattibilità",2017,"-","-","-","-","-","-","-",null,null,null,null,null,null,null,null,0,0,50000,0,0,0,0,0,50000,0]
[null,"107.13046.1","Carimate_RICERCA PERDITE / MAPPATURA RETE / STUDI","Sì","K1","K1.1",508066,"",null,"Carimate","N.A.","",2017,"-","-","-",100,"-","-","-",null,null,null,null,null,null,null,null,0,0,9750,0,0,0,0,0,9750,0]
[null,"402.13046.1","Messa in sicurezza argine a protezione del depuratore","No","D2","D2.2",0,"",null,"Carimate","NO","Progetto definitivo",2017,"-","-","-","-","-","-","-",null,null,null,null,null,null,null,null,0,0,190000,0,0,0,0,0,190000,0]
[null,"403.13046.1","Adeguamento degli impianti elettrici e dell’automazione dell’impianto di depurazione di Carimate (CO) ","No","D2","D2.9",0,"",null,"Carimate","N.A.","Progetto esecutivo",2017,"-","-","-","100% giudizi Conformi / Regolamentari","-","-","-",null,null,null,null,null,null,null,null,0,0,50000,900000,0,0,0,0,50000,900000]
[null,"205.13046.1","Carimate_SCARICATORI DI PIENA - manutenzione straordinaria (prioritario con attivazione immediata)","No","C4","C4.2",216510,"",null,"Carimate","NO","",2017,"-","-","-","1 episodio/anno per scolmatore","-","-","-",null,null,null,null,null,null,null,null,0,0,13737.5,0,0,0,0,0,13737.5,0]
[null,"100.13047.1","Allacciamenti alla rete acquedottistica","No","-","-",0,"",null,"Carlazzo","NO","",2017,"-","-","-","-","-","-","-",null,null,null,null,null,null,null,null,0,0,0,57600,0,0,0,0,0,57600]
[null,"107.13047.1","Carlazzo_RICERCA PERDITE / MAPPATURA RETE / STUDI (ulteriore int. pianificati non prioritari)","Sì","K1","K1.1",508066,"",null,"Carlazzo","N.A.","",2017,"-","-","-",100,"-","-","-",null,null,null,null,null,null,null,null,0,0,9750,0,0,0,0,0,9750,0]
[null,"403.13047.2","Nuovo gruppo elettrogeno","No","D2","D2.9",0,"",null,"Carlazzo","NO","Progetto preliminare",2017,"-","-","-","100% giudizi Conformi / Regolamentari","-","-","-",null,null,null,null,null,null,null,null,0,0,50000,0,0,0,0,0,50000,0]
[null,"200.13047.1","Allacciamenti alla rete fognaria","No","-","-",0,"",null,"Carlazzo","NO","",2017,"-","-","-","-","-","-","-",null,null,null,null,null,null,null,null,0,0,0,84960,0,0,0,0,0,84960]
[null,"201.13047.3","Realizzazione collettori fognari in via Valcavargna","Sì","C1","C1.1",0,20,"rilevata","Carlazzo",null,"Progetto esecutivo",2017,"-","-","-","-","-","-","-",null,null,null,null,null,null,null,null,0,0,180000,0,0,0,0,0,180000,0]
[null,"202.13047.1","Carlazzo_RETI FOGNARIE - manutenzione straordinaria (LOTTO 1)","No","C2","C2.1",0,"",null,"Carlazzo","NO","",2017,"-","-","-","-","-","-","-",null,null,null,null,null,null,null,null,0,0,3027.12,0,0,0,0,0,3027.12,0]
[null,"107.13048.1","Carugo_RICERCA PERDITE / MAPPATURA RETE / STUDI","Sì","K1","K1.1",508066,"",null,"Carugo","N.A.","",2017,"-","-","-",100,"-","-","-",null,null,null,null,null,null,null,null,0,0,9750,0,0,0,0,0,9750,0]
[null,"111.13048.1","MESSA IN SICUREZZA DEGLI IMPIANTI DI SOLLEVAMENTO E ACCUMULO ESISTENTI","No","B8","B8.1",0,"",null,"CARUGO","N.A.","Progetto esecutivo",2017,"-","-","-","-","-","-","-",null,null,null,null,null,null,null,null,0,0,25474.79,0,0,0,0,0,25474.79,0]
[null,"301.13048.1","Adeguamento stazione di sollevamento \"PILASTRELLO\" ","Sì","C2","C2.8",178757,"",null,"Carugo","NO","",2017,"-","-","-","-","-","-","-",null,null,null,null,null,null,null,null,0,0,100000,0,0,0,0,0,100000,0]
[null,"202.13048.1","Rifacimento fognatura Cascina Incasate","Sì","C2","C2.1",0,"",null,"Carugo","NO","",2017,"-","-","-","-","-","-","-",null,null,null,null,null,null,null,null,0,0,55000,5000,0,0,0,0,55000,5000]
[null,"100.13050.1","Allacciamenti alla rete acquedottistica","No","-","-",0,"",null,"Casasco d'Intelvi","NO","",2017,"-","-","-","-","-","-","-",null,null,null,null,null,null,null,null,0,0,0,44800,0,0,0,0,0,44800]
[null,"105.13050.1","Miglioramento qualità per scopi idropotabili","Sì","P2","P2.1",0,"",null,"Casasco d'Intelvi","NO","",2017,"-","-","-","100% giudizi almeno DISCRETO","-","-","-",null,null,null,null,null,null,null,null,0,0,45250,0,0,0,0,0,45250,0]
[null,"200.13050.1","Allacciamenti alla rete fognaria","No","-","-",0,"",null,"Casasco d'Intelvi","NO","",2017,"-","-","-","-","-","-","-",null,null,null,null,null,null,null,null,0,0,0,66080,0,0,0,0,0,66080]
[null,"201.13050.2","Condotte fognarie nella frazione Piazza Grande \"lotto 2\"","No","C1","C1.1",0,35,"rilevata","Casasco d'Intelvi","NO","Progetto preliminare",2017,"-","-","-","-","-","-","-",null,null,null,null,null,null,null,null,0,0,620000,0,0,0,0,0,620000,0]
[null,"107.13052.1","Caslino d'Erba_RICERCA PERDITE / MAPPATURA RETE / STUDI","Sì","K1","K1.1",508066,"",null,"Caslino d'Erba","N.A.","",2017,"-","-","-",100,"-","-","-",null,null,null,null,null,null,null,null,0,0,9750,0,0,0,0,0,9750,0]
[null,"111.13052.1","Caslino d'Erba_Serbatoio Alpe Prina: manutenzione straordinaria","No","B8","B8.1",0,"",null,"Caslino d'Erba","NO","Studio di fattibilità",2017,"-","-","-","-","-","-","-",null,null,null,null,null,null,null,null,0,0,15000,0,0,0,0,0,15000,0]
[null,"111.13052.2","Caslino d'Erba_Serbatoio Gardée: manutenzione straordinaria","No","B8","B8.1",0,"",null,"Caslino d'Erba","NO","Studio di fattibilità",2017,"-","-","-","-","-","-","-",null,null,null,null,null,null,null,null,0,0,10000,0,0,0,0,0,10000,0]
[null,"111.13052.3","Caslino d'Erba_Serbatoio Alpini: manutenzione straordinaria","No","B8","B8.1",0,"",null,"Caslino d'Erba","NO","Studio di fattibilità",2017,"-","-","-","-","-","-","-",null,null,null,null,null,null,null,null,0,0,3000,0,0,0,0,0,3000,0]
[null,"101.13053.1","Messa in sicurezza zona di tutela assoluta pozzo Baragiola e chiusura campo pozzi via Galvani","No","A1","A1.4",633,"",null,"Casnate con Bernate","NO","Studio di fattibilità",2017,"-","-","-","-","-","-","-",null,null,null,null,null,null,null,null,0,0,27150,0,0,0,0,0,27150,0]
[null,"107.13053.1","Casnate con Bernate_RICERCA PERDITE / MAPPATURA RETE / STUDI","Sì","K1","K1.1",508066,"",null,"Casnate con Bernate","N.A.","",2017,"-","-","-",100,"-","-","-",null,null,null,null,null,null,null,null,0,0,9750,0,0,0,0,0,9750,0]
[null,"203.13053.1","Casnate con Bernate_RETI FOGNARIE - Mappatura / Ricerche perdite / Studi - Agglomerato 1","Sì","K1","K1.1",476635,"",null,"Casnate con Bernate","NO","",2017,"-","-","-",100,"-","-","-",null,null,null,null,null,null,null,null,0,0,3238.95,0,0,0,0,0,3238.95,0]
[null,"203.13053.2","Casnate con Bernate_RETI FOGNARIE - Mappatura / Ricerche perdite / Studi - Agglomerato 2","Sì","K1","K1.1",476635,"",null,"Casnate con Bernate","NO","",2017,"-","-","-",100,"-","-","-",null,null,null,null,null,null,null,null,0,0,6511.05,0,0,0,0,0,6511.05,0]
[null,"206.13053.1","Casnate con Bernate_SCARICATORI DI PIENA - nuove opere (inserimento / adeguamento paratoie) (prioritario con attivazione immediata)","No","C4","C4.2",11407,"",null,"Casnate con Bernate","NO","",2017,"-","-","-","1 episodio/anno per scolmatore","-","-","-",null,null,null,null,null,null,null,null,0,0,1900.5,0,0,0,0,0,1900.5,0]
[null,"206.13053.2","Casnate con Bernate_SCARICATORI DI PIENA - nuove opere (inserimento / adeguamento paratoie)","No","C4","C4.2",11407,"",null,"Casnate con Bernate","NO","",2017,"-","-","-","1 episodio/anno per scolmatore","-","-","-",null,null,null,null,null,null,null,null,0,0,4434.5,0,0,0,0,0,4434.5,0]
[null,"106.13055.1","Problematica innalzamento concentrazioni solventi nel campo pozzi all’interno del golf monticello: installazione filtro a carboni attivi","No","P2","P2.1",127812,"",null,"Cassina Rizzardi","NO","Studio di fattibilità",2017,"-","-","-","100% giudizi almeno DISCRETO","-","-","-",null,null,null,null,null,null,null,null,0,0,45250,0,0,0,0,0,45250,0]
[null,"110.13058.1","Castelmarte_RETE DI DISTRIBUZIONE - manutenzione straordinaria / rifacimenti (LOTTO 1)","No","B4","B4.1",10044,"",null,"Castelmarte","NO","",2017,"-","-","-","-","-","-","-",null,null,null,null,null,null,null,null,0,0,1803.07,0,0,0,0,0,1803.07,0]
[null,"107.13058.1","Castelmarte_RICERCA PERDITE / MAPPATURA RETE / STUDI","Sì","K1","K1.1",508066,"",null,"Castelmarte","N.A.","",2017,"-","-","-",100,"-","-","-",null,null,null,null,null,null,null,null,0,0,9750,0,0,0,0,0,9750,0]
[null,"204.13058.1","Castelmarte_RETI FOGNARIE - Separazione reti miste - nuove opere (LOTTO 1)","No","C4","C4.1",0,"",null,"Castelmarte","NO","",2017,"-","-","-","massimo 1 episodio ogni 2 km di rete fognaria presenti nel Comune","-","-","-",null,null,null,null,null,null,null,null,0,0,14451.95,0,0,0,0,0,14451.95,0]
[null,"403.13059.1","Sostituzione dell'impianto di depurazione esistente tradizionale con un impianto di fitodepurazione - lotto 2","No","D2","D2.9",0,"",null,"Castelnuovo Bozzente","NO","Progetto preliminare",2017,"-","-","-","100% giudizi Conformi / Regolamentari","-","-","-",null,null,null,null,null,null,null,null,0,0,350000,0,0,0,0,0,{"$f":"SUM(AC443+AE443+AG443+AI443)","v":350000},{"$f":"SUM(AD443+AF443+AH443+AJ443)","v":0}]
[null,"107.13060.1","Castiglione d'Intelvi_RICERCA PERDITE / MAPPATURA RETE / STUDI","Sì","K1","K1.1",508066,"",null,"Castiglione d'Intelvi","N.A.","",2017,"-","-","-",100,"-","-","-",null,null,null,null,null,null,null,null,0,0,9750,0,0,0,0,0,9750,0]
[null,"203.13060.1","Castiglione d'Intelvi_RETI FOGNARIE - Mappatura / Ricerche perdite / Studi","Sì","K1","K1.1",476635,"",null,"Castiglione d'Intelvi","NO","",2017,"-","-","-",100,"-","-","-",null,null,null,null,null,null,null,null,0,0,9750,0,0,0,0,0,9750,0]
[null,"107.13061.1","Cavallasca_RICERCA PERDITE / MAPPATURA RETE / STUDI","Sì","K1","K1.1",508066,"",null,"Cavallasca","N.A.","",2017,"-","-","-",100,"-","-","-",null,null,null,null,null,null,null,null,0,0,9750,0,0,0,0,0,9750,0]
[null,"207.13061.1","Cavallasca_STAZIONI DI SOLLEVAMENTO - manutenzione straordinaria (prioritario con attivazione immediata) - AGGLOMERATO 2","No","C2","C2.3",4659,"",null,"Cavallasca","NO","",2017,"-","-","-","-","-","-","-",null,null,null,null,null,null,null,null,0,0,8007,0,0,0,0,0,8007,0]
[null,"107.13063.1","Cerano d'Intelvi_RICERCA PERDITE / MAPPATURA RETE / STUDI (ulteriore int. pianificati non prioritari)","Sì","K1","K1.1",508066,"",null,"Cerano d'Intelvi","N.A.","",2017,"-","-","-",100,"-","-","-",null,null,null,null,null,null,null,null,0,0,9750,0,0,0,0,0,9750,0]
[null,"202.13063.1","Cerano d'Intelvi_RETI FOGNARIE - manutenzione straordinaria (LOTTO 1)","No","C2","C2.1",0,"",null,"Cerano d'Intelvi","NO","",2017,"-","-","-","-","-","-","-",null,null,null,null,null,null,null,null,0,0,1503.2,0,0,0,0,0,1503.2,0]
[null,"203.13063.1","Cerano d'Intelvi_RETI FOGNARIE - Mappatura / Ricerche perdite / Studi (prioritario con attivazione immediata)","Sì","K1","K1.1",476635,"",null,"Cerano d'Intelvi","NO","",2017,"-","-","-",100,"-","-","-",null,null,null,null,null,null,null,null,0,0,9750,0,0,0,0,0,9750,0]
[null,"107.13064.1","Cermenate_RICERCA PERDITE / MAPPATURA RETE / STUDI","Sì","K1","K1.1",508066,"",null,"Cermenate","N.A.","",2017,"-","-","-",100,"-","-","-",null,null,null,null,null,null,null,null,0,0,9750,0,0,0,0,0,9750,0]
[null,"202.13064.1","condotte in fascia di rispetto pozzo via I Maggio - LOTTO 1","No","C2","C2.1",0,"",null,"Cermenate","NO","Studio di fattibilità",2017,"-","-","-","-","-","-","-",null,null,null,null,null,null,null,null,0,0,326337.5,0,0,0,0,0,326337.5,0]
[null,"205.13064.1","Scolmatore v. Repubblica - Adeguamento opera civile esistente e rimozione griglia","Sì","C4","C4.2",216510,"",null,"Cermenate","NO","",2017,"-","-","-","1 episodio/anno per scolmatore","-","-","-",null,null,null,null,null,null,null,null,0,0,6000,0,0,0,0,0,6000,0]
[null,"206.13064.1","Scolmatore v. Europa - Posa regolatore di portata","No","C4","C4.2",11407,"",null,"Cermenate","NO","Studio di fattibilità",2017,"-","-","-","1 episodio/anno per scolmatore","-","-","-",null,null,null,null,null,null,null,null,0,0,7200,0,0,0,0,0,7200,0]
[null,"207.13064.1","Cermenate_STAZIONI DI SOLLEVAMENTO - manutenzione straordinaria (LOTTO 1)","No","C2","C2.3",4659,"",null,"Cermenate","NO","",2017,"-","-","-","-","-","-","-",null,null,null,null,null,null,null,null,0,0,8007,0,0,0,0,0,8007,0]
[null,"203.13065.1","Cernobbio_RETI FOGNARIE - Mappatura / Ricerche perdite / Studi","Sì","K1","K1.1",476635,"",null,"Cernobbio","NO","",2017,"-","-","-",100,"-","-","-",null,null,null,null,null,null,null,null,0,0,9750,0,0,0,0,0,9750,0]
[null,"202.13071.1","Claino con Osteno_RETI FOGNARIE - manutenzione straordinaria (LOTTO 1)","No","C2","C2.1",0,"",null,"Claino con Osteno","NO","",2017,"-","-","-","-","-","-","-",null,null,null,null,null,null,null,null,0,0,1368.96,0,0,0,0,0,1368.96,0]
[null,"204.13071.1","SUDDIVISIONE RETE FOGNARIA NELLA FRAZIONE DI BARCLAINO E COLLETTAMENTO PARTE ABITATO ORA NON COLLEGATO","No","C4","C4.1",0,"",null,"Claino con Osteno","NO","Progetto preliminare",2017,"-","-","-","massimo 1 episodio ogni 2 km di rete fognaria presenti nel Comune","-","-","-",null,null,null,null,null,null,null,null,0,0,160000,0,0,0,0,0,160000,0]
[null,"403.13074.1","Griglia Grossolana Ingresso Impianto","No","D2","D2.9",0,"",null,"Colonno","NO","Progetto preliminare",2017,"-","-","-","100% giudizi Conformi / Regolamentari","-","-","-",null,null,null,null,null,null,null,null,0,0,80000,0,0,0,0,0,80000,0]
[null,"403.13074.2","Posizionamento Inverter a servizio delle pompe del sollevamento","No","D2","D2.9",0,"",null,"Colonno","NO","Progetto preliminare",2017,"-","-","-","100% giudizi Conformi / Regolamentari","-","-","-",null,null,null,null,null,null,null,null,0,0,30000,0,0,0,0,0,30000,0]
[null,"110.13251.1","Colverde_RETE DI DISTRIBUZIONE - manutenzione straordinaria / rifacimenti (LOTTO 1)","No","B4","B4.1",10044,"",null,"Colverde","NO","",2017,"-","-","-","-","-","-","-",null,null,null,null,null,null,null,null,0,0,9517.9599999999991,0,0,0,0,0,9517.9599999999991,0]
[null,"205.13251.1","Interventi di potenziamento del sistema di collettamento consortile del Comune di Colverde (LOTTO 1)","No","C4","C4.2",216510,"",null,"Colverde","NO","Studio di fattibilità",2017,"-","-","-","1 episodio/anno per scolmatore","-","-","-",null,null,null,null,null,null,null,null,0,0,1000000,0,0,0,0,0,1000000,0]
[null,"202.13251.1","RIPRISTINO FUNZIONALE FOGNATURA MISTA VIA MULINI FRAZ. DREZZO","No","C2","C2.1",0,"",null,"Colverde","NO","Studio di fattibilità",2017,"-","-","-","-","-","-","-",null,null,null,null,null,null,null,null,0,0,250000,0,0,0,0,0,250000,0]
[null,"203.13251.1","Colverde_RETI FOGNARIE - Mappatura / Ricerche perdite / Studi - AGGLOMERATO 1","Sì","K1","K1.1",476635,"",null,"Colverde","NO","",2017,"-","-","-",100,"-","-","-",null,null,null,null,null,null,null,null,0,0,6827.93,0,0,0,0,0,6827.93,0]
[null,"203.13251.2","Colverde_RETI FOGNARIE - Mappatura / Ricerche perdite / Studi - AGGLOMERATO 2","Sì","K1","K1.1",476635,"",null,"Colverde","NO","",2017,"-","-","-",100,"-","-","-",null,null,null,null,null,null,null,null,0,0,2922.08,0,0,0,0,0,2922.08,0]
[null,"200.13075.2","Allacciamenti alla rete fognaria - Agglomerato 2","No","-","-",0,"",null,"Como","NO","",2017,"-","-","-","-","-","-","-",null,null,null,null,null,null,null,null,0,0,0,158592,0,0,0,0,0,158592]
[null,"201.13075.3","Realizzazione fognatura nera via Camnago superiore - Aquileia Maestri Campionesi - Civiglio (FG01307520)","Sì","C1","C1.1",0,40,"rilevata","Como","NO","",2017,"-","-","-","-","-","-","-",null,null,null,null,null,null,null,null,0,0,140000,0,0,0,0,0,140000,0]
[null,"202.13075.4","Como_RETI FOGNARIE - manutenzione straordinaria (LOTTO 1) - Agglomerato 1","No","C2","C2.1",0,"",null,"Como","NO","",2017,"-","-","-","-","-","-","-",null,null,null,null,null,null,null,null,0,0,11302.62,0,0,0,0,0,11302.62,0]
[null,"202.13075.5","Como_RETI FOGNARIE - manutenzione straordinaria (LOTTO 1) - Agglomerato 3","No","C2","C2.1",0,"",null,"Como","NO","",2017,"-","-","-","-","-","-","-",null,null,null,null,null,null,null,null,0,0,11239.91,0,0,0,0,0,11239.91,0]
[null,"204.13075.1","Fognatura nera Via Ronchetto - Monte Caprino","Sì","C4","C4.1",0,"",null,"Como","NO","",2017,"-","-","-","massimo 1 episodio ogni 2 km di rete fognaria presenti nel Comune","-","-","-",null,null,null,null,null,null,null,null,0,0,150000,0,0,0,0,0,150000,0]
[null,"206.13075.1","Como_SCARICATORI DI PIENA - nuove opere (inserimento / adeguamento paratoie) (LOTTO 1) - Agglomerato 3","No","C4","C4.2",11407,"",null,"Como","NO","",2017,"-","-","-","1 episodio/anno per scolmatore","-","-","-",null,null,null,null,null,null,null,null,0,0,1267,0,0,0,0,0,1267,0]
[null,"207.13075.2","Manutenzione straordinaria stazioni di sollevamento e dissabbiatori - intervento 2","Sì","C2","C2.3",4659,"",null,"Como","NO","",2017,"-","-","-","-","-","-","-",null,null,null,null,null,null,null,null,0,0,50000,0,0,0,0,0,50000,0]
[null,"110.13077.2","Manutenzione straordinaria acquedotto e fognatura - loc. Monti Croc","Sì","B4","B4.1",10044,"",null,"Corrido","NO","Progetto preliminare",2017,"-","-","-","-","-","-","-",null,null,null,null,null,null,null,null,0,0,19250,20000,0,0,0,0,19250,20000]
[null,"202.13077.1","Corrido_RETI FOGNARIE - manutenzione straordinaria (LOTTO 1)","No","C2","C2.1",0,"",null,"Corrido","NO","",2017,"-","-","-","-","-","-","-",null,null,null,null,null,null,null,null,0,0,870.88,0,0,0,0,0,870.88,0]
[null,"203.13077.1","Corrido_RETI FOGNARIE - Mappatura / Ricerche perdite / Studi (prioritario con attivazione immediata)","Sì","K1","K1.1",476635,"",null,"Corrido","NO","",2017,"-","-","-",100,"-","-","-",null,null,null,null,null,null,null,null,0,0,9750,0,0,0,0,0,9750,0]
[null,"107.13083.1","Cremia_RICERCA PERDITE / MAPPATURA RETE / STUDI (ulteriore int. pianificati non prioritari)","Sì","K1","K1.1",508066,"",null,"Cremia","N.A.","",2017,"-","-","-",100,"-","-","-",null,null,null,null,null,null,null,null,0,0,9750,0,0,0,0,0,9750,0]
[null,"403.13083.1","Trattamenti terziari - fornitura e posa ","No","D2","D2.9",0,"",null,"Cremia","NO","Progetto preliminare",2017,"-","-","-","100% giudizi Conformi / Regolamentari","-","-","-",null,null,null,null,null,null,null,null,0,0,240000,0,0,0,0,0,240000,0]
[null,"403.13083.1","Trattamenti terziari - Ricostruzione del manufatto di disinfezione e filtrazione finale in calcestruzzo - demolizione del manufatto esistente","No","D2","D2.9",0,"",null,"Cremia","NO","Progetto preliminare",2017,"-","-","-","100% giudizi Conformi / Regolamentari","-","-","-",null,null,null,null,null,null,null,null,0,0,225000,0,0,0,0,0,225000,0]
[null,"403.13083.1","Posa nuova griglia ingresso impianto ","No","D2","D2.9",0,"",null,"Cremia","NO","Progetto preliminare",2017,"-","-","-","100% giudizi Conformi / Regolamentari","-","-","-",null,null,null,null,null,null,null,null,0,0,125000,0,0,0,0,0,125000,0]
[null,"202.13084.1","Completamento fognatura via del Pozzo","Sì","C2","C2.1",0,"",null,"Cucciago","NO","Studio di fattibilità",2017,"-","-","-","-","-","-","-",null,null,null,null,null,null,null,null,0,0,65000,0,0,0,0,0,65000,0]
[null,"203.13084.1","Cucciago_RETI FOGNARIE - Mappatura / Ricerche perdite / Studi","Sì","K1","K1.1",476635,"",null,"Cucciago","NO","",2017,"-","-","-",100,"-","-","-",null,null,null,null,null,null,null,null,0,0,9750,0,0,0,0,0,9750,0]
[null,"204.13084.1","Cucciago_RETI FOGNARIE - Separazione reti miste - nuove opere (LOTTO 1)","No","C4","C4.1",0,"",null,"Cucciago","NO","",2017,"-","-","-","massimo 1 episodio ogni 2 km di rete fognaria presenti nel Comune","-","-","-",null,null,null,null,null,null,null,null,0,0,21456.65,0,0,0,0,0,21456.65,0]
[null,"203.13085.1","Cusino_RETI FOGNARIE - Mappatura / Ricerche perdite / Studi","Sì","K1","K1.1",476635,"",null,"Cusino","NO","",2017,"-","-","-",100,"-","-","-",null,null,null,null,null,null,null,null,0,0,9750,0,0,0,0,0,9750,0]
[null,"107.13087.1","Dizzasco_RICERCA PERDITE / MAPPATURA RETE / STUDI","Sì","K1","K1.1",508066,"",null,"Dizzasco","N.A.","",2017,"-","-","-",100,"-","-","-",null,null,null,null,null,null,null,null,0,0,9750,0,0,0,0,0,9750,0]
[null,"110.13089.1","Domaso_RETE DI DISTRIBUZIONE - manutenzione straordinaria / rifacimenti (LOTTO 1)","No","B4","B4.1",10044,"",null,"Domaso","NO","",2017,"-","-","-","-","-","-","-",null,null,null,null,null,null,null,null,0,0,4839.92,0,0,0,0,0,4839.92,0]
[null,"203.13089.1","Domaso_RETI FOGNARIE - Mappatura / Ricerche perdite / Studi","Sì","K1","K1.1",476635,"",null,"Domaso","NO","",2017,"-","-","-",100,"-","-","-",null,null,null,null,null,null,null,null,0,0,9750,0,0,0,0,0,9750,0]
[null,"102.13090.1","Potenziamento stazione di derivazione acqua uso potabile","Sì","A1","A1.1",0,"",null,"Dongo","NO","",2017,"-","-","-",0,"-","-","-",null,null,null,null,null,null,null,null,0,0,39250,0,0,0,0,0,39250,0]
[null,"204.13090.1","POSA TUBAZIONI ACQUE NERE PORZIONI STRADALI DI VIA SS340 - VIA G.RUBINI - VIA ALDO RUMI PER SEPARAZIONE RETE MISTA ESISTENTE","No","C4","C4.1",0,"",null,"Dongo","NO","",2017,"-","-","-","massimo 1 episodio ogni 2 km di rete fognaria presenti nel Comune","-","-","-",null,null,null,null,null,null,null,null,0,0,110000,0,0,0,0,0,110000,0]
[null,"207.13090.1","ADEGUAMENTO TECNOLOGICO STAZIONI DI POMPAGGIO","No","C2","C2.3",4659,"",null,"Dongo","NO","Progetto preliminare",2017,"-","-","-","-","-","-","-",null,null,null,null,null,null,null,null,0,0,40000,0,0,0,0,0,40000,0]
[null,"104.13092.1","LAVORI DI RIPRISTINO FUNZIONALE ACQUEDOTTO IN LOC. PRATONARO E MOTTALA","Sì","A1","A1.1",60449,"",null,"Dosso del Liro","NO","Progetto preliminare",2017,"-","-","-",0,"-","-","-",null,null,null,null,null,null,null,null,0,0,20815,0,0,0,0,0,20815,0]
[null,"110.13092.1","Sostituzione Tubazione acquedotto in località Monte Ciosino","Sì","B4","B4.1",10044,"",null,"Dosso del Liro","NO","Progetto preliminare",2017,"-","-","-","-","-","-","-",null,null,null,null,null,null,null,null,0,0,11775,0,0,0,0,0,11775,0]
[null,"110.13095.1","VIA FOSCOLO-CLERICI (inserimento riduttore di pressione)","No","B4","B4.1",10044,"",null,"Erba","NO","Progetto preliminare",2017,"-","-","-","-","-","-","-",null,null,null,null,null,null,null,null,0,0,30000,0,0,0,0,0,30000,0]
[null,"110.13095.2","VIA 1° MAGGIO (da via L.DaVinci a via Buonarroti): ml 380","Sì","B4","B4.1",10044,"",null,"Erba","NO","Progetto preliminare",2017,"-","-","-","-","-","-","-",null,null,null,null,null,null,null,null,0,0,35000,0,0,0,0,0,35000,0]
[null,"107.13095.1","MAPPATURA RETI E PRESE E GOEREFERENZIAZIONE","No","K1","K1.1",508066,"",null,"Erba","N.A.","Studio di fattibilità",2017,"-","-","-",100,"-","-","-",null,null,null,null,null,null,null,null,0,0,80000,0,0,0,0,0,80000,0]
[null,"203.13095.1","Erba_RETI FOGNARIE - Mappatura / Ricerche perdite / Studi","Sì","K1","K1.1",476635,"",null,"Erba","NO","",2017,"-","-","-",100,"-","-","-",null,null,null,null,null,null,null,null,0,0,9750,0,0,0,0,0,9750,0]
[null,"204.13095.1","Erba_RETI FOGNARIE - Separazione reti miste - nuove opere (LOTTO 1)","No","C4","C4.1",0,"",null,"Erba","NO","",2017,"-","-","-","massimo 1 episodio ogni 2 km di rete fognaria presenti nel Comune","-","-","-",null,null,null,null,null,null,null,null,0,0,84273.600000000006,0,0,0,0,0,84273.600000000006,0]
[null,"107.13097.1","Eupilio_RICERCA PERDITE / MAPPATURA RETE / STUDI (ulteriore int. pianificati non prioritari)","Sì","K1","K1.1",508066,"",null,"Eupilio","N.A.","",2017,"-","-","-",100,"-","-","-",null,null,null,null,null,null,null,null,0,0,9750,0,0,0,0,0,9750,0]
[null,"204.13097.1","Eupilio_RETI FOGNARIE - Separazione reti miste - nuove opere (LOTTO 1)","No","C4","C4.1",0,"",null,"Eupilio","NO","",2017,"-","-","-","massimo 1 episodio ogni 2 km di rete fognaria presenti nel Comune","-","-","-",null,null,null,null,null,null,null,null,0,0,18037.099999999999,0,0,0,0,0,18037.099999999999,0]
[null,"206.13097.1","Eupilio_SCARICATORI DI PIENA - nuove opere (inserimento / adeguamento paratoie) (prioritario con attivazione immediata)","No","C4","C4.2",11407,"",null,"Eupilio","NO","",2017,"-","-","-","1 episodio/anno per scolmatore","-","-","-",null,null,null,null,null,null,null,null,0,0,3167.5,0,0,0,0,0,3167.5,0]
[null,"107.13098.1","Faggeto Lario_RICERCA PERDITE / MAPPATURA RETE / STUDI","Sì","K1","K1.1",508066,"",null,"Faggeto Lario","N.A.","",2017,"-","-","-",100,"-","-","-",null,null,null,null,null,null,null,null,0,0,9750,0,0,0,0,0,9750,0]
[null,"203.13098.1","Faggeto Lario_RETI FOGNARIE - Mappatura / Ricerche perdite / Studi","Sì","K1","K1.1",476635,"",null,"Faggeto Lario","NO","",2017,"-","-","-",100,"-","-","-",null,null,null,null,null,null,null,null,0,0,9750,0,0,0,0,0,9750,0]
[null,"204.13098.1","Faggeto Lario_RETI FOGNARIE - Separazione reti miste - nuove opere (LOTTO 1)","No","C4","C4.1",0,"",null,"Faggeto Lario","NO","",2017,"-","-","-","massimo 1 episodio ogni 2 km di rete fognaria presenti nel Comune","-","-","-",null,null,null,null,null,null,null,null,0,0,110975.63,0,0,0,0,0,110975.63,0]
[null,"110.13099.1","Sostituzione tratto tubazione generale di caricio serbatoio (località Valmulini, zona torrente Fornace)","Sì","B4","B4.1",10044,"",null,"FALOPPIO","NO","Progetto preliminare",2017,"-","-","-","-","-","-","-",null,null,null,null,null,null,null,null,0,0,30000,0,0,0,0,0,30000,0]
[null,"204.13099.1","Faloppio_RETI FOGNARIE - Separazione reti miste - nuove opere (LOTTO 1)","No","C4","C4.1",0,"",null,"Faloppio","NO","",2017,"-","-","-","massimo 1 episodio ogni 2 km di rete fognaria presenti nel Comune","-","-","-",null,null,null,null,null,null,null,null,0,0,26457.68,0,0,0,0,0,26457.68,0]
[null,"111.13100.1","Adeguamento serbatoi - Messa a norma degli impianti elettrici dei 2 serbatoi comunali","No","B8","B8.1",0,"",null,"Fenegrò","NO","Studio di fattibilità",2017,"-","-","-","-","-","-","-",null,null,null,null,null,null,null,null,0,0,117650,0,0,0,0,0,117650,0]
[null,"206.13100.1","Fenegrò_SCARICATORI DI PIENA - nuove opere (inserimento / adeguamento paratoie) (prioritario con attivazione immediata)","No","C4","C4.2",11407,"",null,"Fenegrò","NO","",2017,"-","-","-","1 episodio/anno per scolmatore","-","-","-",null,null,null,null,null,null,null,null,0,0,2534,0,0,0,0,0,2534,0]
[null,"107.13101.1","Figino Serenza_RICERCA PERDITE / MAPPATURA RETE / STUDI (ulteriore int. pianificati non prioritari)","Sì","K1","K1.1",508066,"",null,"Figino Serenza","N.A.","",2017,"-","-","-",100,"-","-","-",null,null,null,null,null,null,null,null,0,0,6240,0,0,0,0,0,{"$f":"SUM(AC507+AE507+AG507+AI507)","v":6240},{"$f":"SUM(AD507+AF507+AH507+AJ507)","v":0}]
[null,"107.13101.2","RICERCA PERDITE ","Sì","K1","K1.1",508066,"",null,"FIGINO SERENZA","N.A.","",2017,"-","-","-",100,"-","-","-",null,null,null,null,null,null,null,null,0,0,3510,0,0,0,0,0,3510,0]
[null,"111.13101.1","MESSA IN SICUREZZA DEGLI IMPIANTI DI SOLLEVAMENTO E ACCUMULO ESISTENTI","No","B8","B8.1",0,"",null,"FIGINO SERENZA","N.A.","Progetto esecutivo",2017,"-","-","-","-","-","-","-",null,null,null,null,null,null,null,null,0,0,21112.42,0,0,0,0,0,21112.42,0]
[null,"203.13101.1","Figino Serenza_RETI FOGNARIE - Mappatura / Ricerche perdite / Studi (prioritario con attivazione immediata)","Sì","K1","K1.1",476635,"",null,"Figino Serenza","NO","",2017,"-","-","-",100,"-","-","-",null,null,null,null,null,null,null,null,0,0,9750,0,0,0,0,0,9750,0]
[null,"102.13102.1","Adeguamento centrale Pazzea","No","A1","A1.1",0,"",null,"Fino Mornasco","NO","Studio di fattibilità",2017,"-","-","-",0,"-","-","-",null,null,null,null,null,null,null,null,0,0,86350,0,0,0,0,0,86350,0]
[null,"110.13102.1","Rifacimento tratto di rete via Raimondi – p.za Mercato","No","B4","B4.1",10044,"",null,"Fino Mornasco","NO","Studio di fattibilità",2017,"-","-","-","-","-","-","-",null,null,null,null,null,null,null,null,0,0,74575,0,0,0,0,0,74575,0]
[null,"110.13102.2","Rifacimento/potenziamento reti in via Monte Grappa, via Grigna","No","B4","B4.1",10044,"",null,"Fino Mornasco","NO","Studio di fattibilità",2017,"-","-","-","-","-","-","-",null,null,null,null,null,null,null,null,0,0,150000,0,0,0,0,0,150000,0]
[null,"403.13102.1","Nuova sezione decolorazione con ozono Impianto di depurazione Livescia - Fino Mornasco","No","D2","D2.9",0,"",null,"Fino Mornasco","NO","",2017,"-","-","-","100% giudizi Conformi / Regolamentari","-","-","-",null,null,null,null,null,null,null,null,0,0,600000,0,0,0,0,0,600000,0]
[null,"403.13102.2","Adeguamento strumentazione on line sezione biologica","No","D2","D2.9",0,"",null,"Fino Mornasco","NO","",2017,"-","-","-","100% giudizi Conformi / Regolamentari","-","-","-",null,null,null,null,null,null,null,null,0,0,20000,0,0,0,0,0,20000,0]
[null,"406.13102.1","Fino Mornasco - Livescia_DEPURATORE ESISTENTE - Telecontrollo","Sì","K3","K3.1",0,"",null,"Fino Mornasco","N.A.","Studio di fattibilità",2017,"-","-","-","-","-","-","-",null,null,null,null,null,null,null,null,0,0,28000,0,0,0,0,0,28000,0]
[null,"201.13102.1","Realizzazione fognatura lungo SS 35 località Socco","No","C1","C1.1",0,"",null,"Fino Mornasco","NO","Studio di fattibilità",2017,"-","-","-","-","-","-","-",null,null,null,null,null,null,null,null,0,0,230000,0,0,0,0,0,230000,0]
[null,"202.13102.2","Fino Mornasco_RETI FOGNARIE - manutenzione straordinaria (LOTTO 1) - Agglomerato 3","No","C2","C2.1",0,"",null,"Fino Mornasco","NO","",2017,"-","-","-","-","-","-","-",null,null,null,null,null,null,null,null,0,0,9622.85,0,0,0,0,0,9622.85,0]
[null,"203.13102.1","Fino Mornasco_RETI FOGNARIE - Mappatura / Ricerche perdite / Studi - Agglomerato 1","Sì","K1","K1.1",476635,"",null,"Fino Mornasco","NO","",2017,"-","-","-",100,"-","-","-",null,null,null,null,null,null,null,null,0,0,2816.78,0,0,0,0,0,2816.78,0]
[null,"203.13102.2","Fino Mornasco_RETI FOGNARIE - Mappatura / Ricerche perdite / Studi - Agglomerato 2","Sì","K1","K1.1",476635,"",null,"Fino Mornasco","NO","",2017,"-","-","-",100,"-","-","-",null,null,null,null,null,null,null,null,0,0,1729.65,0,0,0,0,0,1729.65,0]
[null,"203.13102.3","Fino Mornasco_RETI FOGNARIE - Mappatura / Ricerche perdite / Studi - Agglomerato 3","Sì","K1","K1.1",476635,"",null,"Fino Mornasco","NO","",2017,"-","-","-",100,"-","-","-",null,null,null,null,null,null,null,null,0,0,2656.88,0,0,0,0,0,2656.88,0]
[null,"203.13102.4","Fino Mornasco_RETI FOGNARIE - Mappatura / Ricerche perdite / Studi - Agglomerato 4","Sì","K1","K1.1",476635,"",null,"Fino Mornasco","NO","",2017,"-","-","-",100,"-","-","-",null,null,null,null,null,null,null,null,0,0,2547.6799999999998,0,0,0,0,0,2547.6799999999998,0]
[null,"205.13102.1","Fino Mornasco_SCARICATORI DI PIENA - manutenzione straordinaria (LOTTO 1) - Agglomerato 1","No","C4","C4.2",216510,"",null,"Fino Mornasco","NO","",2017,"-","-","-","1 episodio/anno per scolmatore","-","-","-",null,null,null,null,null,null,null,null,0,0,7850,0,0,0,0,0,7850,0]
[null,"205.13102.2","Fino Mornasco_SCARICATORI DI PIENA - manutenzione straordinaria (LOTTO 1) - Agglomerato 2","No","C4","C4.2",216510,"",null,"Fino Mornasco","NO","",2017,"-","-","-","1 episodio/anno per scolmatore","-","-","-",null,null,null,null,null,null,null,null,0,0,1962.5,0,0,0,0,0,1962.5,0]
[null,"205.13102.3","Fino Mornasco_SCARICATORI DI PIENA - manutenzione straordinaria (LOTTO 1) - Agglomerato 3","No","C4","C4.2",216510,"",null,"Fino Mornasco","NO","",2017,"-","-","-","1 episodio/anno per scolmatore","-","-","-",null,null,null,null,null,null,null,null,0,0,11775,0,0,0,0,0,11775,0]
[null,"205.13102.4","Fino Mornasco_SCARICATORI DI PIENA - manutenzione straordinaria (LOTTO 1) - Agglomerato 4","No","C4","C4.2",216510,"",null,"Fino Mornasco","NO","",2017,"-","-","-","1 episodio/anno per scolmatore","-","-","-",null,null,null,null,null,null,null,null,0,0,19625,0,0,0,0,0,19625,0]
[null,"401.13106.1","Garzeno_COSTRUZIONE NUOVO IMPIANTO DI DEPURAZIONE E RELATIVI COLLETTORI (LOTTO 1)","Sì","D1","D1.1",0,"",null,"Garzeno","NO","",2017,"-","-","-",100,"-","-","-",null,null,null,null,null,null,null,null,0,0,450000,0,0,0,0,0,450000,0]
[null,"202.13106.1","Garzeno_RETI FOGNARIE - manutenzione straordinaria (LOTTO 1)","No","C2","C2.1",0,"",null,"Garzeno","NO","",2017,"-","-","-","-","-","-","-",null,null,null,null,null,null,null,null,0,0,908.56,0,0,0,0,0,908.56,0]
[null,"203.13106.1","Garzeno_RETI FOGNARIE - Mappatura / Ricerche perdite / Studi","Sì","K1","K1.1",476635,"",null,"Garzeno","NO","",2017,"-","-","-",100,"-","-","-",null,null,null,null,null,null,null,null,0,0,9750,0,0,0,0,0,9750,0]
[null,"107.13107.1","Gera Lario_RICERCA PERDITE / MAPPATURA RETE / STUDI","Sì","K1","K1.1",508066,"",null,"Gera Lario","N.A.","",2017,"-","-","-",100,"-","-","-",null,null,null,null,null,null,null,null,0,0,9750,0,0,0,0,0,9750,0]
[null,"203.13107.1","Gera Lario_RETI FOGNARIE - Mappatura / Ricerche perdite / Studi","Sì","K1","K1.1",476635,"",null,"Gera Lario","NO","",2017,"-","-","-",100,"-","-","-",null,null,null,null,null,null,null,null,0,0,9750,0,0,0,0,0,9750,0]
[null,"102.13110.1","verifica e sistemazione pozzo n. 1 dell'acquedotto comunale","No","A1","A1.1",0,"",null,"Grandate","NO","Studio di fattibilità",2017,"-","-","-",0,"-","-","-",null,null,null,null,null,null,null,null,0,0,30000,0,0,0,0,0,30000,0]
[null,"202.13110.1","Grandate_RETI FOGNARIE - manutenzione straordinaria (LOTTO 1) - Agglomerato 1","No","C2","C2.1",0,"",null,"Grandate","NO","",2017,"-","-","-","-","-","-","-",null,null,null,null,null,null,null,null,0,0,3206.36,0,0,0,0,0,3206.36,0]
[null,"203.13110.1","interventi sulla rete fognaria: video ispezione - Agglomerato 1","Sì","K1","K1.1",476635,"",null,"Grandate","NO","",2017,"-","-","-",100,"-","-","-",null,null,null,null,null,null,null,null,0,0,3300,0,0,0,0,0,3300,0]
[null,"203.13110.2","interventi sulla rete fognaria: video ispezione - Agglomerato 1","No","K1","K1.1",476635,"",null,"Grandate","NO","",2017,"-","-","-",100,"-","-","-",null,null,null,null,null,null,null,null,0,0,26700,0,0,0,0,0,26700,0]
[null,"105.13249.1","Completamento opere acquedottistiche - Rifacimento debatterizzatore in loc. Lara","Sì","P2","P2.1",0,"",null,"Gravedona ed Uniti","NO","Progetto preliminare",2017,"-","-","-","100% giudizi almeno DISCRETO","-","-","-",null,null,null,null,null,null,null,null,0,0,72400,0,0,0,0,0,72400,0]
[null,"402.13249.1","Revamping elettrico completo","No","D2","D2.2",0,"",null,"Gravedona ed Uniti","NO","Progetto preliminare",2017,"-","-","-","-","-","-","-",null,null,null,null,null,null,null,null,0,0,200000,0,0,0,0,0,200000,0]
[null,"403.13249.1","Manutenzione Impianto (Vasca ossidazione linea 1)","No","D2","D2.9",0,"",null,"Gravedona ed Uniti","NO","Progetto preliminare",2017,"-","-","-","100% giudizi Conformi / Regolamentari","-","-","-",null,null,null,null,null,null,null,null,0,0,35000,0,0,0,0,0,35000,0]
[null,"202.13249.1","Gravedona ed Uniti_RETI FOGNARIE - manutenzione straordinaria (LOTTO 1)","No","C2","C2.1",0,"",null,"Gravedona ed Uniti","NO","",2017,"-","-","-","-","-","-","-",null,null,null,null,null,null,null,null,0,0,6329.3,0,0,0,0,0,6329.3,0]
[null,"107.13113.1","Griante_RICERCA PERDITE / MAPPATURA RETE / STUDI (ulteriore int. pianificati non prioritari)","Sì","K1","K1.1",508066,"",null,"Griante","N.A.","",2017,"-","-","-",100,"-","-","-",null,null,null,null,null,null,null,null,0,0,9750,0,0,0,0,0,9750,0]
[null,"107.13114.1","Guanzate_RICERCA PERDITE / MAPPATURA RETE / STUDI","Sì","K1","K1.1",508066,"",null,"Guanzate","N.A.","",2017,"-","-","-",100,"-","-","-",null,null,null,null,null,null,null,null,0,0,9750,0,0,0,0,0,9750,0]
[null,"202.13114.1","condotte in fascia di rispetto pozzo via Libertà - Intervento 1","No","C2","C2.1",0,"",null,"Guanzate","NO","Studio di fattibilità",2017,"-","-","-","-","-","-","-",null,null,null,null,null,null,null,null,0,0,190068.5,0,0,0,0,0,190068.5,0]
[null,"110.13118.2","Rifacimento rete acquedotto via Magni","Sì","B4","B4.1",10044,"",null,"Inverigo","NO","",2017,"-","-","-","-","-","-","-",null,null,null,null,null,null,null,null,0,0,19625,0,0,0,0,0,19625,0]
[null,"200.13118.3","Allacciamenti alla rete fognaria","No","-","-",0,"",null,"Inverigo","NO","",2017,"-","-","-","-","-","-","-",null,null,null,null,null,null,null,null,0,0,0,278480,0,0,0,0,0,278480]
[null,"201.13118.4","FOGNATURA fraz. CARPANEA VIA MAGNI BASSA","Sì","C1","C1.1",0,60,"rilevata","Inverigo","NO","Studio di fattibilità",2017,"-","-","-","-","-","-","-",null,null,null,null,null,null,null,null,0,0,85000,0,0,0,0,0,85000,0]
[null,"202.13118.1","FORMAZIONE NUOVA RETE DI FOGNATURA A SERVIZIO DELLA VIA BUONARROTI E ZONE LIMITROFE","Sì","C2","C2.1",0,50,"rilevata","Inverigo","NO","Studio di fattibilità",2017,"-","-","-","-","-","-","-",null,null,null,null,null,null,null,null,0,0,550000,0,0,0,0,0,550000,0]
[null,"202.13118.3","Inverigo_RETI FOGNARIE - manutenzione straordinaria (LOTTO 1) - Agglomerato 1","No","C2","C2.1",0,"",null,"Inverigo","NO","",2017,"-","-","-","-","-","-","-",null,null,null,null,null,null,null,null,0,0,6882.01,0,0,0,0,0,6882.01,0]
[null,"205.13118.1","Inverigo_SCARICATORI DI PIENA - manutenzione straordinaria (LOTTO 1) - Agglomerato 1","No","C4","C4.2",216510,"",null,"Inverigo","NO","",2017,"-","-","-","1 episodio/anno per scolmatore","-","-","-",null,null,null,null,null,null,null,null,0,0,1962.5,0,0,0,0,0,1962.5,0]
[null,"205.13118.2","Inverigo_SCARICATORI DI PIENA - manutenzione straordinaria (LOTTO 1) - Agglomerato 3","No","C4","C4.2",216510,"",null,"Inverigo","NO","",2017,"-","-","-","1 episodio/anno per scolmatore","-","-","-",null,null,null,null,null,null,null,null,0,0,11775,0,0,0,0,0,11775,0]
[null,"102.13119.1","adeguamento opere di presa Sorgente BUCO dell'ORSO Comune di Laglio","No","A1","A1.1",0,"",null,"Laglio","NO","Studio di fattibilità",2017,"-","-","-",0,"-","-","-",null,null,null,null,null,null,null,null,0,0,150000,0,0,0,0,0,150000,0]
[null,"107.13119.1","Laglio_RICERCA PERDITE / MAPPATURA RETE / STUDI","Sì","K1","K1.1",508066,"",null,"Laglio","N.A.","",2017,"-","-","-",100,"-","-","-",null,null,null,null,null,null,null,null,0,0,9750,0,0,0,0,0,9750,0]
[null,"202.13119.1","Laglio_RETI FOGNARIE - manutenzione straordinaria (LOTTO 1)","No","C2","C2.1",0,"",null,"Laglio","NO","",2017,"-","-","-","-","-","-","-",null,null,null,null,null,null,null,null,0,0,895.61,0,0,0,0,0,895.61,0]
[null,"107.13120.1","Laino_RICERCA PERDITE / MAPPATURA RETE / STUDI (ulteriore int. pianificati non prioritari)","Sì","K1","K1.1",508066,"",null,"Laino","N.A.","",2017,"-","-","-",100,"-","-","-",null,null,null,null,null,null,null,null,0,0,9750,0,0,0,0,0,9750,0]
[null,"203.13121.1","Lambrugo_RETI FOGNARIE - Mappatura / Ricerche perdite / Studi - Agglomerato 1","Sì","K1","K1.1",476635,"",null,"Lambrugo","NO","",2017,"-","-","-",100,"-","-","-",null,null,null,null,null,null,null,null,0,0,903.83,0,0,0,0,0,903.83,0]
[null,"203.13121.2","Lambrugo_RETI FOGNARIE - Mappatura / Ricerche perdite / Studi - Agglomerato 2","Sì","K1","K1.1",476635,"",null,"Lambrugo","NO","",2017,"-","-","-",100,"-","-","-",null,null,null,null,null,null,null,null,0,0,8846.18,0,0,0,0,0,8846.18,0]
[null,"100.13122.1","Allacciamenti alla rete acquedottistica","No","-","-",0,"",null,"Lanzo d'Intelvi","NO","",2017,"-","-","-","-","-","-","-",null,null,null,null,null,null,null,null,0,0,0,236800,0,0,0,0,0,236800]
[null,"107.13122.1","Lanzo d'Intelvi_RICERCA PERDITE / MAPPATURA RETE / STUDI (ulteriore int. pianificati non prioritari)","Sì","K1","K1.1",508066,"",null,"Lanzo d'Intelvi","N.A.","",2017,"-","-","-",100,"-","-","-",null,null,null,null,null,null,null,null,0,0,9750,0,0,0,0,0,9750,0]
[null,"200.13122.1","Allacciamenti alla rete fognaria","No","-","-",0,"",null,"Lanzo d'Intelvi","NO","",2017,"-","-","-","-","-","-","-",null,null,null,null,null,null,null,null,0,0,0,349280,0,0,0,0,0,349280]
[null,"201.13122.1","Rete fognaria via Pizzarera","Sì","C1","C1.1",0,40,"rilevata","Lanzo d'Intelvi","NO","Studio di fattibilità",2017,"-","-","-","-","-","-","-",null,null,null,null,null,null,null,null,0,0,100000,0,0,0,0,0,100000,0]
[null,"201.13122.3","COMPLETAMENTO RETE FOGNARIA NELLA FRAZIONE SCARIA, IN VIA BATTISTI/GOLDONI E VIA SIGHIGNOLA","Sì","C1","C1.1",0,184,"rilevata","Lanzo d'Intelvi","NO","Studio di fattibilità",2017,"-","-","-","-","-","-","-",null,null,null,null,null,null,null,null,0,0,230000,0,0,0,0,0,230000,0]
[null,"203.13122.1","Lanzo d'Intelvi_RETI FOGNARIE - Mappatura / Ricerche perdite / Studi (prioritario con attivazione immediata)","Sì","K1","K1.1",476635,"",null,"Lanzo d'Intelvi","NO","",2017,"-","-","-",100,"-","-","-",null,null,null,null,null,null,null,null,0,0,9750,0,0,0,0,0,9750,0]
[null,"202.13123.1","Lasnigo_RETI FOGNARIE - manutenzione straordinaria (LOTTO 1)","No","C2","C2.1",0,"",null,"Lasnigo","NO","",2017,"-","-","-","-","-","-","-",null,null,null,null,null,null,null,null,0,0,3101.54,0,0,0,0,0,3101.54,0]
[null,"204.13123.1","Lasnigo_RETI FOGNARIE - Separazione reti miste - nuove opere (LOTTO 1)","No","C4","C4.1",0,"",null,"Lasnigo","NO","",2017,"-","-","-","massimo 1 episodio ogni 2 km di rete fognaria presenti nel Comune","-","-","-",null,null,null,null,null,null,null,null,0,0,3575.66,0,0,0,0,0,3575.66,0]
[null,"110.13126.1","Lezzeno_RETE DI DISTRIBUZIONE - manutenzione straordinaria / rifacimenti (LOTTO 1)","No","B4","B4.1",10044,"",null,"Lezzeno","NO","",2017,"-","-","-","-","-","-","-",null,null,null,null,null,null,null,null,0,0,4328.18,0,0,0,0,0,4328.18,0]
[null,"107.13126.1","Lezzeno_RICERCA PERDITE / MAPPATURA RETE / STUDI","Sì","K1","K1.1",508066,"",null,"Lezzeno","N.A.","",2017,"-","-","-",100,"-","-","-",null,null,null,null,null,null,null,null,0,0,9750,0,0,0,0,0,9750,0]
[null,"203.13126.1","Lezzeno_RETI FOGNARIE - Mappatura / Ricerche perdite / Studi","Sì","K1","K1.1",476635,"",null,"Lezzeno","NO","",2017,"-","-","-",100,"-","-","-",null,null,null,null,null,null,null,null,0,0,9750,0,0,0,0,0,9750,0]
[null,"403.13128.1","Dissabbiatura e disoleatura","No","D2","D2.9",0,"",null,"Limido Comasco","NO","Progetto preliminare",2017,"-","-","-","100% giudizi Conformi / Regolamentari","-","-","-",null,null,null,null,null,null,null,null,0,0,263000,0,0,0,0,0,263000,0]
[null,"403.13128.2","Abbattimento fosforo","No","D2","D2.9",0,"",null,"Limido Comasco","NO","Progetto preliminare",2017,"-","-","-","100% giudizi Conformi / Regolamentari","-","-","-",null,null,null,null,null,null,null,null,0,0,45000,0,0,0,0,0,45000,0]
[null,"203.13128.1","Limido Comasco_RETI FOGNARIE - Mappatura / Ricerche perdite / Studi","Sì","K1","K1.1",476635,"",null,"Limido Comasco","NO","",2017,"-","-","-",100,"-","-","-",null,null,null,null,null,null,null,null,0,0,9750,0,0,0,0,0,9750,0]
[null,"207.13128.1","Limido Comasco_STAZIONI DI SOLLEVAMENTO - manutenzione straordinaria (LOTTO 1)","No","C2","C2.3",4659,"",null,"Limido Comasco","NO","",2017,"-","-","-","-","-","-","-",null,null,null,null,null,null,null,null,0,0,4003.5,0,0,0,0,0,4003.5,0]
[null,"203.13129.1","CAMPAGNA RIDUZIONE ACQUE ESTRANEE AI COLLETTORI FOGNARI","No","K1","K1.1",476635,"",null,"Lipomo","NO","Studio di fattibilità",2017,"-","-","-",100,"-","-","-",null,null,null,null,null,null,null,null,0,0,15000,0,0,0,0,0,{"$f":"SUM(AC571+AE571+AG571+AI571)","v":15000},{"$f":"SUM(AD571+AF571+AH571+AJ571)","v":0}]
[null,"205.13129.1","SCOLMATORE LOCALITA' PARADISO","No","C4","C4.2",216510,"",null,"Lipomo","NO","Studio di fattibilità",2017,"-","-","-","1 episodio/anno per scolmatore","-","-","-",null,null,null,null,null,null,null,null,0,0,60000,0,0,0,0,0,60000,0]
[null,"107.13131.1","Locate Varesino_RICERCA PERDITE / MAPPATURA RETE / STUDI","Sì","K1","K1.1",508066,"",null,"Locate Varesino","N.A.","",2017,"-","-","-",100,"-","-","-",null,null,null,null,null,null,null,null,0,0,9750,0,0,0,0,0,9750,0]
[null,"107.13133.1","Lomazzo_RICERCA PERDITE / MAPPATURA RETE / STUDI","Sì","K1","K1.1",508066,"",null,"Lomazzo","N.A.","",2017,"-","-","-",100,"-","-","-",null,null,null,null,null,null,null,null,0,0,9750,0,0,0,0,0,9750,0]
[null,"202.13133.1","Sostituzione o risanamento strutturale delle tubazioni in fascia di rispetto del pozzo Braghe II - Intervento 1","No","C2","C2.1",0,"",null,"Lomazzo","NO","Studio di fattibilità",2017,"-","-","-","-","-","-","-",null,null,null,null,null,null,null,null,0,0,15812.5,0,0,0,0,0,15812.5,0]
[null,"202.13133.2","Sostituzione o risanamento strutturale delle tubazioni in fascia di rispetto del pozzo Manera - Intervento 1","No","C2","C2.1",0,"",null,"Lomazzo","NO","Studio di fattibilità",2017,"-","-","-","-","-","-","-",null,null,null,null,null,null,null,null,0,0,46125,0,0,0,0,0,46125,0]
[null,"202.13133.3","Sostituzione o risanamento strutturale delle tubazioni in fascia di rispetto del pozzo Torre - Intervento 1","No","C2","C2.1",0,"",null,"Lomazzo","NO","Studio di fattibilità",2017,"-","-","-","-","-","-","-",null,null,null,null,null,null,null,null,0,0,48596.25,0,0,0,0,0,48596.25,0]
[null,"203.13133.1","Lomazzo_RETI FOGNARIE - Mappatura / Ricerche perdite / Studi","Sì","K1","K1.1",476635,"",null,"Lomazzo","NO","",2017,"-","-","-",100,"-","-","-",null,null,null,null,null,null,null,null,0,0,9750,0,0,0,0,0,9750,0]
[null,"205.13133.3","Adeguamento manufatto scolmatore 4C1 - Stabilizzazione del fondo alveo e delle sponde","Sì","C4","C4.2",216510,"",null,"Lomazzo","NO","Studio di fattibilità",2017,"-","-","-","1 episodio/anno per scolmatore","-","-","-",null,null,null,null,null,null,null,null,0,0,3600,0,0,0,0,0,3600,0]
[null,"104.13134.1","Variante in sanatoria della concessione di derivazione di acqua da pozzi ubicati sul territorio di Longone al Segrino","No","A1","A1.1",60449,"",null,"Longone al Segrino","NO","",2017,"-","-","-",0,"-","-","-",null,null,null,null,null,null,null,null,0,0,54300,0,0,0,0,0,54300,0]
[null,"110.13134.1","SOSTITUZIONE TUBAZIONE DI COLLEGAMENTO SERBATOIO SEGRINO CON RETE DI ERBA - CIRCA 1200 MT TUBAZIONE DE 180 PEAD","No","B4","B4.1",10044,"",null,"Longone al Segrino","NO","Progetto preliminare",2017,"-","-","-","-","-","-","-",null,null,null,null,null,null,null,null,0,0,150000,0,0,0,0,0,150000,0]
[null,"107.13134.1","Longone al Segrino_RICERCA PERDITE / MAPPATURA RETE / STUDI","Sì","K1","K1.1",508066,"",null,"Longone al Segrino","N.A.","",2017,"-","-","-",100,"-","-","-",null,null,null,null,null,null,null,null,0,0,9750,0,0,0,0,0,9750,0]
[null,"202.13134.1","Longone al Segrino_RETI FOGNARIE - manutenzione straordinaria (LOTTO 1)","No","C2","C2.1",0,"",null,"Longone al Segrino","NO","",2017,"-","-","-","-","-","-","-",null,null,null,null,null,null,null,null,0,0,4931.37,0,0,0,0,0,4931.37,0]
[null,"203.13134.1","Longone al Segrino_RETI FOGNARIE - Mappatura / Ricerche perdite / Studi","Sì","K1","K1.1",476635,"",null,"Longone al Segrino","NO","",2017,"-","-","-",100,"-","-","-",null,null,null,null,null,null,null,null,0,0,9750,0,0,0,0,0,9750,0]
[null,"101.13135.1","Adeguamento aree pertinenza pozzo Golf","No","A1","A1.4",633,"",null,"Villa Guardia","NO","Studio di fattibilità",2017,"-","-","-","-","-","-","-",null,null,null,null,null,null,null,null,0,0,18100,0,0,0,0,0,18100,0]
[null,"106.13135.2","Realizzazione  sistema di disinfezione a raggi UV presso centrale Livescia","No","P2","P2.1",127812,"",null,"Luisago","NO","Studio di fattibilità",2017,"-","-","-","100% giudizi almeno DISCRETO","-","-","-",null,null,null,null,null,null,null,null,0,0,40000,0,0,0,0,0,40000,0]
[null,"110.13135.1","Adeguamento rete acquedotto tratto via IV Novembre via al Ronco","No","B4","B4.1",10044,"",null,"Luisago","NO","Studio di fattibilità",2017,"-","-","-","-","-","-","-",null,null,null,null,null,null,null,null,0,0,62800,0,0,0,0,0,62800,0]
[null,"203.13136.1","Lurago d'Erba_RETI FOGNARIE - Mappatura / Ricerche perdite / Studi - Agglomerato 1","Sì","K1","K1.1",476635,"",null,"Lurago d'Erba","NO","",2017,"-","-","-",100,"-","-","-",null,null,null,null,null,null,null,null,0,0,2304.9,0,0,0,0,0,2304.9,0]
[null,"203.13136.2","Lurago d'Erba_RETI FOGNARIE - Mappatura / Ricerche perdite / Studi - Agglomerato 2","Sì","K1","K1.1",476635,"",null,"Lurago d'Erba","NO","",2017,"-","-","-",100,"-","-","-",null,null,null,null,null,null,null,null,0,0,7445.1,0,0,0,0,0,7445.1,0]
[null,"202.13137.1","Lurago Marinone_RETI FOGNARIE - manutenzione straordinaria (LOTTO 1)","No","C2","C2.1",0,"",null,"Lurago Marinone","NO","",2017,"-","-","-","-","-","-","-",null,null,null,null,null,null,null,null,0,0,17441.13,0,0,0,0,0,17441.13,0]
[null,"110.13138.1","Manutenzione straordinaria edifici, area e impianti elettrici ed elettromeccanici delle Stazioni di sollevamento e spinta “Livescia” e “Cagnola”. ","No","B4","B4.1",10044,"",null,"Lurate Caccivio","NO","Studio di fattibilità",2017,"-","-","-","-","-","-","-",null,null,null,null,null,null,null,null,0,0,235500,0,0,0,0,0,235500,0]
[null,"202.13138.1","Rifacimento collettore comunale in via Vittorio Emanuele","Sì","C2","C2.1",0,"",null,"Lurate Caccivio","NO","Studio di fattibilità",2017,"-","-","-","-","-","-","-",null,null,null,null,null,null,null,null,0,0,150000,0,0,0,0,0,150000,0]
[null,"203.13138.1","Lurate Caccivio_RETI FOGNARIE - Mappatura / Ricerche perdite / Studi (prioritario con attivazione immediata)","Sì","K1","K1.1",476635,"",null,"Lurate Caccivio","NO","",2017,"-","-","-",100,"-","-","-",null,null,null,null,null,null,null,null,0,0,9750,0,0,0,0,0,9750,0]
[null,"107.13139.1","Magreglio_RICERCA PERDITE / MAPPATURA RETE / STUDI","Sì","K1","K1.1",508066,"",null,"Magreglio","N.A.","",2017,"-","-","-",100,"-","-","-",null,null,null,null,null,null,null,null,0,0,9750,0,0,0,0,0,9750,0]
[null,"202.13139.1","Magreglio_RETI FOGNARIE - manutenzione straordinaria (LOTTO 1)","No","C2","C2.1",0,"",null,"Magreglio","NO","",2017,"-","-","-","-","-","-","-",null,null,null,null,null,null,null,null,0,0,6790.64,0,0,0,0,0,6790.64,0]
[null,"203.13139.1","Magreglio_RETI FOGNARIE - Mappatura / Ricerche perdite / Studi","Sì","K1","K1.1",476635,"",null,"Magreglio","NO","",2017,"-","-","-",100,"-","-","-",null,null,null,null,null,null,null,null,0,0,9750,0,0,0,0,0,9750,0]
[null,"100.13143.1","Allacciamenti alla rete acquedottistica","No","-","-",0,"",null,"Mariano Comense","NO","",2017,"-","-","-","-","-","-","-",null,null,null,null,null,null,null,null,0,0,0,32000,0,0,0,0,0,32000]
[null,"110.13143.1","Mariano Comense_RETE DI DISTRIBUZIONE - manutenzione straordinaria / rifacimenti (LOTTO 1)","No","B4","B4.1",10044,"",null,"Mariano Comense","NO","",2017,"-","-","-","-","-","-","-",null,null,null,null,null,null,null,null,0,0,39954.300000000003,0,0,0,0,0,39954.300000000003,0]
[null,"402.13143.1","Fornitura ed installazione nuovo impianto di pretrattamento reflui extra fognari (ex art. 110 D.Lgs. 152/2006)","No","D2","D2.2",0,"",null,"Mariano Comense","NO","Studio di fattibilità",2017,"-","-","-","-","-","-","-",null,null,null,null,null,null,null,null,0,0,120000,0,0,0,0,0,120000,0]
[null,"402.13143.2","Formazione sistemi per la discesa ed il recupero in sicurezza a corredo delle vasche dell'impianto di depurazione, in attuazione del programma di migliorramento della sicurezza dell'impianto ","No","D2","D2.2",0,"",null,"Mariano Comense","NO","Studio di fattibilità",2017,"-","-","-","-","-","-","-",null,null,null,null,null,null,null,null,0,0,30000,0,0,0,0,0,30000,0]
[null,"403.13143.1","Insonorizzazione locale compressori presso il depuratore di Mariano Comense","No","D2","D2.9",0,"",null,"Mariano Comense","NO","Progetto preliminare",2017,"-","-","-","100% giudizi Conformi / Regolamentari","-","-","-",null,null,null,null,null,null,null,null,0,0,25000,0,0,0,0,0,25000,0]
[null,"200.13003.1","Allacciamenti alla rete fognaria","No","-","-",0,"",null,"Mariano Comense","NO","",2017,"-","-","-","-","-","-","-",null,null,null,null,null,null,null,null,0,0,0,47200,0,0,0,0,0,47200]
[null,"201.13143.1","ESTENSIONE RETE FOGNARIA VIA GRAMSCI","No","C1","C1.1",0,50,"rilevata","Mariano Comense","NO","",2017,"-","-","-","-","-","-","-",null,null,null,null,null,null,null,null,0,0,80000,0,0,0,0,0,80000,0]
[null,"202.13143.1","Mariano Comense_RETI FOGNARIE - manutenzione straordinaria (LOTTO 1) - Agglomerato 3","No","C2","C2.1",0,"",null,"Mariano Comense","NO","",2017,"-","-","-","-","-","-","-",null,null,null,null,null,null,null,null,0,0,4609.55,0,0,0,0,0,4609.55,0]
[null,"202.13143.2","POTENZIAMENTO FOGNATURA MISTA DI VIA S. ALESSANDRO - TRATTO COMPRESO TRA VIA DELL'ORTO E STOPPANI","Sì","C2","C2.1",0,"",null,"Mariano Comense","NO","Progetto definitivo",2017,"-","-","-","-","-","-","-",null,null,null,null,null,null,null,null,0,0,7330,292670,0,0,0,0,7330,292670]
[null,"205.13143.1","Mariano Comense_SCARICATORI DI PIENA - manutenzione straordinaria (LOTTO 1) - Agglomerato 1","No","C4","C4.2",216510,"",null,"Mariano Comense","NO","",2017,"-","-","-","1 episodio/anno per scolmatore","-","-","-",null,null,null,null,null,null,null,null,0,0,23550,0,0,0,0,0,23550,0]
[null,"203.13144.1","Maslianico_RETI FOGNARIE - Mappatura / Ricerche perdite / Studi","Sì","K1","K1.1",476635,"",null,"Maslianico","NO","",2017,"-","-","-",100,"-","-","-",null,null,null,null,null,null,null,null,0,0,9750,0,0,0,0,0,9750,0]
[null,"107.13145.1","Menaggio_RICERCA PERDITE / MAPPATURA RETE / STUDI","Sì","K1","K1.1",508066,"",null,"Menaggio","N.A.","",2017,"-","-","-",100,"-","-","-",null,null,null,null,null,null,null,null,0,0,9750,0,0,0,0,0,9750,0]
[null,"403.13145.1","Gruppo Elettrogeno","No","D2","D2.9",0,"",null,"Menaggio","NO","Progetto preliminare",2017,"-","-","-","100% giudizi Conformi / Regolamentari","-","-","-",null,null,null,null,null,null,null,null,0,0,150000,0,0,0,0,0,150000,0]
[null,"202.13145.1","Menaggio_RETI FOGNARIE - manutenzione straordinaria (LOTTO 1)","No","C2","C2.1",0,"",null,"Menaggio","NO","",2017,"-","-","-","-","-","-","-",null,null,null,null,null,null,null,null,0,0,3693.58,0,0,0,0,0,3693.58,0]
[null,"203.13145.1","Menaggio_RETI FOGNARIE - Mappatura / Ricerche perdite / Studi","Sì","K1","K1.1",476635,"",null,"Menaggio","NO","",2017,"-","-","-",100,"-","-","-",null,null,null,null,null,null,null,null,0,0,9750,0,0,0,0,0,9750,0]
[null,"110.13147.1","Merone_RETE DI DISTRIBUZIONE - manutenzione straordinaria / rifacimenti (LOTTO 1)","No","B4","B4.1",10044,"",null,"Merone","NO","",2017,"-","-","-","-","-","-","-",null,null,null,null,null,null,null,null,0,0,4523.72,0,0,0,0,0,4523.72,0]
[null,"107.13147.1","Merone_RICERCA PERDITE / MAPPATURA RETE / STUDI","Sì","K1","K1.1",508066,"",null,"Merone","N.A.","",2017,"-","-","-",100,"-","-","-",null,null,null,null,null,null,null,null,0,0,9750,0,0,0,0,0,9750,0]
[null,"202.13153.1","Monguzzo_RETI FOGNARIE - manutenzione straordinaria (LOTTO 1)","No","C2","C2.1",0,"",null,"Monguzzo","NO","",2017,"-","-","-","-","-","-","-",null,null,null,null,null,null,null,null,0,0,10550.4,0,0,0,0,0,10550.4,0]
[null,"204.13153.1","Monguzzo_RETI FOGNARIE - Separazione reti miste - nuove opere (LOTTO 1)","No","C4","C4.1",0,"",null,"Monguzzo","NO","",2017,"-","-","-","massimo 1 episodio ogni 2 km di rete fognaria presenti nel Comune","-","-","-",null,null,null,null,null,null,null,null,0,0,12163.2,0,0,0,0,0,12163.2,0]
[null,"105.13154.1","SERBATOIO DI VIA MANZONI - Sistema di potabilizzazione","No","P2","P2.1",0,"",null,"Montano Lucino","NO","",2017,"-","-","-","100% giudizi almeno DISCRETO","-","-","-",null,null,null,null,null,null,null,null,0,0,25000,0,0,0,0,0,25000,0]
[null,"110.13154.1","Montano Lucino_RETE DI DISTRIBUZIONE - manutenzione straordinaria / rifacimenti (LOTTO 1)","No","B4","B4.1",10044,"",null,"Montano Lucino","NO","",2017,"-","-","-","-","-","-","-",null,null,null,null,null,null,null,null,0,0,5906.19,0,0,0,0,0,5906.19,0]
[null,"202.13154.1","Montano Lucino_RETI FOGNARIE - manutenzione straordinaria (LOTTO 1) - Agglomerato 1","No","C2","C2.1",0,"",null,"Montano Lucino","NO","",2017,"-","-","-","-","-","-","-",null,null,null,null,null,null,null,null,0,0,903.69,0,0,0,0,0,903.69,0]
[null,"203.13154.1","Studio per risoluzione problematiche fognatura via Modigliani","No","K1","K1.1",476635,"",null,"Montano Lucino","NO","",2017,"-","-","-",100,"-","-","-",null,null,null,null,null,null,null,null,0,0,40000,0,0,0,0,0,40000,0]
[null,"102.13157.1","Adeguamento pozzi a seguito di prescrizioni successive alla regolarizzazione della concessione di derivazione","No","A1","A1.1",0,"",null,"Montorfano","NO","Studio di fattibilità",2017,"-","-","-",0,"-","-","-",null,null,null,null,null,null,null,null,0,0,40000,0,0,0,0,0,40000,0]
[null,"205.13157.1","Adeguamento scolmatori o punti di scarico delle fognature all'autorizzazione provinciale (LOTTO 1)","No","C4","C4.2",216510,"",null,"Montorfano","NO","Studio di fattibilità",2017,"-","-","-","1 episodio/anno per scolmatore","-","-","-",null,null,null,null,null,null,null,null,0,0,50000,0,0,0,0,0,50000,0]
[null,"107.13159.1","Mozzate_RICERCA PERDITE / MAPPATURA RETE / STUDI","Sì","K1","K1.1",508066,"",null,"Mozzate","N.A.","",2017,"-","-","-",100,"-","-","-",null,null,null,null,null,null,null,null,0,0,9750,0,0,0,0,0,9750,0]
[null,"110.13160.1","Adeguamento diametri Campagnano","No","B4","B4.1",10044,"",null,"Musso","NO","",2017,"-","-","-","-","-","-","-",null,null,null,null,null,null,null,null,0,0,100000,0,0,0,0,0,100000,0]
[null,"402.13160.1","Dismissione e conversione del depuratore di Musso e conferimento dei reflui all'impianto di Cremia","No","D2","D2.2",0,"",null,"Musso","NO","Studio di fattibilità",2017,"-","-","-","-","-","-","-",null,null,null,null,null,null,null,null,0,0,200000,0,0,0,0,0,200000,0]
[null,"107.13161.1","Nesso_RICERCA PERDITE / MAPPATURA RETE / STUDI","Sì","K1","K1.1",508066,"",null,"Nesso","N.A.","",2017,"-","-","-",100,"-","-","-",null,null,null,null,null,null,null,null,0,0,9750,0,0,0,0,0,9750,0]
[null,"402.13161.1","Rifacimento completo quadri elettrici","No","D2","D2.2",0,"",null,"Nesso","NO","Progetto preliminare",2017,"-","-","-","-","-","-","-",null,null,null,null,null,null,null,null,0,0,20000,0,0,0,0,0,20000,0]
[null,"403.13161.1","Adeguamenti Impianto di Depurazione Nesso - Careno","No","D2","D2.9",0,"",null,"Nesso","NO","Progetto preliminare",2017,"-","-","-","100% giudizi Conformi / Regolamentari","-","-","-",null,null,null,null,null,null,null,null,0,0,30000,0,0,0,0,0,30000,0]
[null,"202.13161.1","Nesso_RETI FOGNARIE - manutenzione straordinaria (LOTTO 1) - Agglomerato 1","No","C2","C2.1",0,"",null,"Nesso","NO","",2017,"-","-","-","-","-","-","-",null,null,null,null,null,null,null,null,0,0,1491.49,0,0,0,0,0,1491.49,0]
[null,"202.13161.2","Nesso_RETI FOGNARIE - manutenzione straordinaria (LOTTO 1) - Agglomerato 2","No","C2","C2.1",0,"",null,"Nesso","NO","",2017,"-","-","-","-","-","-","-",null,null,null,null,null,null,null,null,0,0,541.34,0,0,0,0,0,541.34,0]
[null,"203.13161.1","Nesso_RETI FOGNARIE - Mappatura / Ricerche perdite / Studi - Agglomerato 1","Sì","K1","K1.1",476635,"",null,"Nesso","NO","",2017,"-","-","-",100,"-","-","-",null,null,null,null,null,null,null,null,0,0,7153.58,0,0,0,0,0,7153.58,0]
[null,"203.13161.2","Nesso_RETI FOGNARIE - Mappatura / Ricerche perdite / Studi - Agglomerato 2","Sì","K1","K1.1",476635,"",null,"Nesso","NO","",2017,"-","-","-",100,"-","-","-",null,null,null,null,null,null,null,null,0,0,2596.4299999999998,0,0,0,0,0,2596.4299999999998,0]
[null,"102.13163.2","INTERVENTO DI ADEGUAMENTO POZZO \"CIMNAGO\"","No","A1","A1.1",0,"",null,"Novedrate","NO","Progetto preliminare",2017,"-","-","-",0,"-","-","-",null,null,null,null,null,null,null,null,0,0,30000,0,0,0,0,0,30000,0]
[null,"202.13163.1","Novedrate_RETI FOGNARIE - manutenzione straordinaria (LOTTO 1)","No","C2","C2.1",0,"",null,"Novedrate","NO","",2017,"-","-","-","-","-","-","-",null,null,null,null,null,null,null,null,0,0,20513.23,0,0,0,0,0,20513.23,0]
[null,"203.13163.1","Novedrate_RETI FOGNARIE - Mappatura / Ricerche perdite / Studi","Sì","K1","K1.1",476635,"",null,"Novedrate","NO","",2017,"-","-","-",100,"-","-","-",null,null,null,null,null,null,null,null,0,0,9750,0,0,0,0,0,9750,0]
[null,"206.13163.1","Novedrate_SCARICATORI DI PIENA - nuove opere (inserimento / adeguamento paratoie) (prioritario con attivazione immediata)","No","C4","C4.2",11407,"",null,"Novedrate","NO","",2017,"-","-","-","1 episodio/anno per scolmatore","-","-","-",null,null,null,null,null,null,null,null,0,0,3167.5,0,0,0,0,0,{"$f":"SUM(AC635+AE635+AG635+AI635)","v":3167.5},{"$f":"SUM(AD635+AF635+AH635+AJ635)","v":0}]
[null,"102.13165.1","Adeguamento area di tutela assoluta delle sorgenti Valmorea e rifacimento condotta di adduzione","No","A1","A1.1",0,"",null,"Valmorea","NO","Studio di fattibilità",2017,"-","-","-",0,"-","-","-",null,null,null,null,null,null,null,null,0,0,510250,0,0,0,0,0,510250,0]
[null,"107.13165.1","Olgiate Comasco_RICERCA PERDITE / MAPPATURA RETE / STUDI","Sì","K1","K1.1",508066,"",null,"Olgiate Comasco","N.A.","",2017,"-","-","-",100,"-","-","-",null,null,null,null,null,null,null,null,0,0,9750,0,0,0,0,0,9750,0]
[null,"302.13165.4","Lavori di rifacimento condotte zona Nord in comune di Olgiate Comasco – Lotto C Stralcio 1 (Via Bizzarone e zona Forno inceneritore)","No","C2","C2.1",0,"",null,"Olgiate Comasco","NO","Progetto definitivo",2017,"-","-","-","-","-","-","-",null,null,null,null,null,null,null,null,0,0,2000000,0,0,0,0,0,2000000,0]
[null,"202.13165.1","Adeguamento della rete fognaria della frazione Casletto, presso le Vie Marconi - Fermi e limitrofe","Sì","C2","C2.1",0,"",null,"Olgiate Comasco","NO","Studio di fattibilità",2017,"-","-","-","-","-","-","-",null,null,null,null,null,null,null,null,0,0,480000,0,0,0,0,0,480000,0]
[null,"110.13169.1","Rifacimento tratto di acquedotto via San Mamette, via Caduti Oltronesi","No","B4","B4.1",10044,"",null,"Oltrona San Mamette","NO","Studio di fattibilità",2017,"-","-","-","-","-","-","-",null,null,null,null,null,null,null,null,0,0,133450,0,0,0,0,0,133450,0]
[null,"203.13169.1","Oltrona San Mamette_RETI FOGNARIE - Mappatura / Ricerche perdite / Studi","Sì","K1","K1.1",476635,"",null,"Oltrona San Mamette","NO","",2017,"-","-","-",100,"-","-","-",null,null,null,null,null,null,null,null,0,0,9750,0,0,0,0,0,9750,0]
[null,"110.13170.1","RETE IDRICA VIA MANZONI","Sì","B4","B4.1",10044,"",null,"ORSENIGO","NO","Progetto preliminare",2017,"-","-","-","-","-","-","-",null,null,null,null,null,null,null,null,0,0,30000,0,0,0,0,0,30000,0]
[null,"107.13170.2","Orsenigo_RICERCA PERDITE / MAPPATURA RETE / STUDI (ulteriore int. pianificati non prioritari)","Sì","K1","K1.1",508066,"",null,"Orsenigo","N.A.","",2017,"-","-","-",100,"-","-","-",null,null,null,null,null,null,null,null,0,0,1750,0,0,0,0,0,1750,0]
[null,"202.13170.1","Orsenigo_RETI FOGNARIE - manutenzione straordinaria (LOTTO 1) - Agglomerato 1","No","C2","C2.1",0,"",null,"Orsenigo","NO","",2017,"-","-","-","-","-","-","-",null,null,null,null,null,null,null,null,0,0,11302.97,0,0,0,0,0,11302.97,0]
[null,"203.13170.1","Orsenigo_RETI FOGNARIE - Mappatura / Ricerche perdite / Studi - Agglomerato 1","Sì","K1","K1.1",476635,"",null,"Orsenigo","NO","",2017,"-","-","-",100,"-","-","-",null,null,null,null,null,null,null,null,0,0,5833.43,0,0,0,0,0,5833.43,0]
[null,"203.13170.2","Orsenigo_RETI FOGNARIE - Mappatura / Ricerche perdite / Studi - Agglomerato 2","Sì","K1","K1.1",476635,"",null,"Orsenigo","NO","",2017,"-","-","-",100,"-","-","-",null,null,null,null,null,null,null,null,0,0,3916.58,0,0,0,0,0,3916.58,0]
[null,"110.13178.1","Manutenzione straordinaria acquedotto comunale","Sì","B4","B4.1",10044,"",null,"Peglio","N.A.","Progetto esecutivo",2017,"-","-","-","-","-","-","-",null,null,null,null,null,null,null,null,0,0,15700,0,0,0,0,0,15700,0]
[null,"107.13179.1","Pellio Intelvi_RICERCA PERDITE / MAPPATURA RETE / STUDI (ulteriore int. pianificati non prioritari)","Sì","K1","K1.1",508066,"",null,"Pellio Intelvi","N.A.","",2017,"-","-","-",100,"-","-","-",null,null,null,null,null,null,null,null,0,0,9750,0,0,0,0,0,9750,0]
[null,"202.13183.1","Pianello del Lario_RETI FOGNARIE - manutenzione straordinaria (LOTTO 1)","No","C2","C2.1",0,"",null,"Pianello del Lario","NO","",2017,"-","-","-","-","-","-","-",null,null,null,null,null,null,null,null,0,0,1794.98,0,0,0,0,0,1794.98,0]
[null,"202.13184.1","Pigra_RETI FOGNARIE - manutenzione straordinaria (LOTTO 1)","No","C2","C2.1",0,"",null,"Pigra","NO","",2017,"-","-","-","-","-","-","-",null,null,null,null,null,null,null,null,0,0,564.96,0,0,0,0,0,564.96,0]
[null,"203.13184.1","Pigra_RETI FOGNARIE - Mappatura / Ricerche perdite / Studi","Sì","K1","K1.1",476635,"",null,"Pigra","NO","",2017,"-","-","-",100,"-","-","-",null,null,null,null,null,null,null,null,0,0,9750,0,0,0,0,0,9750,0]
[null,"100.13185.1","Allacciamenti alla rete acquedottistica","No","-","-",0,"",null,"Plesio","NO","",2017,"-","-","-","-","-","-","-",null,null,null,null,null,null,null,null,0,0,0,16000,0,0,0,0,0,16000]
[null,"107.13185.1","Plesio_RICERCA PERDITE / MAPPATURA RETE / STUDI","Sì","K1","K1.1",508066,"",null,"Plesio","N.A.","",2017,"-","-","-",100,"-","-","-",null,null,null,null,null,null,null,null,0,0,9750,0,0,0,0,0,9750,0]
[null,"200.13185.1","Allacciamenti alla rete fognaria","No","-","-",0,"",null,"Plesio","NO","",2017,"-","-","-","-","-","-","-",null,null,null,null,null,null,null,null,0,0,0,23600,0,0,0,0,0,23600]
[null,"202.13185.1","Plesio_RETI FOGNARIE - manutenzione straordinaria (LOTTO 1)","No","C2","C2.1",0,"",null,"Plesio","NO","",2017,"-","-","-","-","-","-","-",null,null,null,null,null,null,null,null,0,0,2407.2800000000002,0,0,0,0,0,2407.2800000000002,0]
[null,"203.13185.1","Plesio_RETI FOGNARIE - Mappatura / Ricerche perdite / Studi","Sì","K1","K1.1",476635,"",null,"Plesio","NO","",2017,"-","-","-",100,"-","-","-",null,null,null,null,null,null,null,null,0,0,9750,0,0,0,0,0,9750,0]
[null,"100.13186.1","Allacciamenti alla rete acquedottistica","No","-","-",0,"",null,"Pognana Lario","NO","",2017,"-","-","-","-","-","-","-",null,null,null,null,null,null,null,null,0,0,0,59200,0,0,0,0,0,59200]
[null,"200.13186.1","Allacciamenti alla rete fognaria","No","-","-",0,"",null,"Pognana Lario","NO","",2017,"-","-","-","-","-","-","-",null,null,null,null,null,null,null,null,0,0,0,87320,0,0,0,0,0,87320]
[null,"201.13186.1","Collettore fognario via Matteotti civ. 126-128","No","C1","C1.1",0,93,"rilevata","Pognana Lario","NO","",2017,"-","-","-","-","-","-","-",null,null,null,null,null,null,null,null,0,0,125000,0,0,0,0,0,125000,0]
[null,"204.13186.1","Interventi di razionalizzazione della rete fognaria comunale in località Quarzano","No","C4","C4.1",0,"",null,"Pognana Lario","NO","Progetto preliminare",2017,"-","-","-","massimo 1 episodio ogni 2 km di rete fognaria presenti nel Comune","-","-","-",null,null,null,null,null,null,null,null,0,0,120000,0,0,0,0,0,120000,0]
[null,"110.13188.1","riqualificazione lungo via Matteotti","No","B4","B4.1",10044,"",null,"Ponte Lambro","NO","",2017,"-","-","-","-","-","-","-",null,null,null,null,null,null,null,null,0,0,171000,0,0,0,0,0,171000,0]
[null,"105.13189.1","ADEGUAMENTO SISTEMI DI POTABILIZZAZIONE DELLE ACQUE","No","P2","P2.1",0,"",null,"Porlezza","NO","",2017,"-","-","-","100% giudizi almeno DISCRETO","-","-","-",null,null,null,null,null,null,null,null,0,0,45250,0,0,0,0,0,45250,0]
[null,"107.13189.1","Porlezza_RICERCA PERDITE / MAPPATURA RETE / STUDI","Sì","K1","K1.1",508066,"",null,"Porlezza","N.A.","",2017,"-","-","-",100,"-","-","-",null,null,null,null,null,null,null,null,0,0,9750,0,0,0,0,0,9750,0]
[null,"403.13189.1","Griglia ingresso ad arco","No","D2","D2.9",0,"",null,"Porlezza","NO","Progetto preliminare",2017,"-","-","-","100% giudizi Conformi / Regolamentari","-","-","-",null,null,null,null,null,null,null,null,0,0,30000,0,0,0,0,0,30000,0]
[null,"403.13189.2","Manutenzione Impianto","No","D2","D2.9",0,"",null,"Porlezza","NO","Progetto preliminare",2017,"-","-","-","100% giudizi Conformi / Regolamentari","-","-","-",null,null,null,null,null,null,null,null,0,0,85000,0,0,0,0,0,85000,0]
[null,"202.13189.1","Porlezza_RETI FOGNARIE - manutenzione straordinaria (LOTTO 1)","No","C2","C2.1",0,"",null,"Porlezza","NO","",2017,"-","-","-","-","-","-","-",null,null,null,null,null,null,null,null,0,0,5040.88,0,0,0,0,0,5040.88,0]
[null,"205.13189.1","ADEGUAMENTO SCOLMATORE VIA GHIACCIAIA CON RIFACIMENTO TRATTO DI CONDOTTA FOGNARIA ESISTENTE","No","C4","C4.2",216510,"",null,"Porlezza","NO","Studio di fattibilità",2017,"-","-","-","1 episodio/anno per scolmatore","-","-","-",null,null,null,null,null,null,null,null,0,0,40000,0,0,0,0,0,40000,0]
[null,"100.13192.1","Allacciamenti alla rete acquedottistica","No","-","-",0,"",null,"Proserpio","NO","",2017,"-","-","-","-","-","-","-",null,null,null,null,null,null,null,null,0,0,0,28800,0,0,0,0,0,28800]
[null,"110.13192.1","Proserpio_RETE DI DISTRIBUZIONE - manutenzione straordinaria / rifacimenti (LOTTO 1)","No","B4","B4.1",10044,"",null,"Proserpio","NO","",2017,"-","-","-","-","-","-","-",null,null,null,null,null,null,null,null,0,0,2798.5,0,0,0,0,0,2798.5,0]
[null,"107.13192.1","Proserpio_RICERCA PERDITE / MAPPATURA RETE / STUDI","Sì","K1","K1.1",508066,"",null,"Proserpio","N.A.","",2017,"-","-","-",100,"-","-","-",null,null,null,null,null,null,null,null,0,0,9750,0,0,0,0,0,9750,0]
[null,"201.13192.1","Fognatura via Spinei","Sì","C1","C1.1",0,20,"rilevata","Proserpio","NO","",2017,"-","-","-","-","-","-","-",null,null,null,null,null,null,null,null,0,0,40000,0,0,0,0,0,40000,0]
[null,"202.13192.1","Proserpio_RETI FOGNARIE - manutenzione straordinaria (LOTTO 1)","No","C2","C2.1",0,"",null,"Proserpio","NO","",2017,"-","-","-","-","-","-","-",null,null,null,null,null,null,null,null,0,0,5782.7,0,0,0,0,0,5782.7,0]
[null,"203.13192.1","Proserpio_RETI FOGNARIE - Mappatura / Ricerche perdite / Studi","Sì","K1","K1.1",476635,"",null,"Proserpio","NO","",2017,"-","-","-",100,"-","-","-",null,null,null,null,null,null,null,null,0,0,9750,0,0,0,0,0,9750,0]
[null,"204.13192.1","Proserpio_RETI FOGNARIE - Separazione reti miste - nuove opere (LOTTO 1)","No","C4","C4.1",0,"",null,"Proserpio","NO","",2017,"-","-","-","massimo 1 episodio ogni 2 km di rete fognaria presenti nel Comune","-","-","-",null,null,null,null,null,null,null,null,0,0,6666.68,0,0,0,0,0,6666.68,0]
[null,"100.13193.1","Allacciamenti alla rete acquedottistica","No","-","-",0,"",null,"Pusiano","NO","",2017,"-","-","-","-","-","-","-",null,null,null,null,null,null,null,null,0,0,0,92800,0,0,0,0,0,92800]
[null,"110.13193.1","Pusiano_RETE DI DISTRIBUZIONE - manutenzione straordinaria / rifacimenti (LOTTO 1)","No","B4","B4.1",10044,"",null,"Pusiano","NO","",2017,"-","-","-","-","-","-","-",null,null,null,null,null,null,null,null,0,0,10573.24,0,0,0,0,0,10573.24,0]
[null,"200.13193.1","Allacciamenti alla rete fognaria","No","-","-",0,"",null,"Pusiano","NO","",2017,"-","-","-","-","-","-","-",null,null,null,null,null,null,null,null,0,0,0,136880,0,0,0,0,0,136880]
[null,"201.13193.1","Pusiano_RETI FOGNARIE - Estensione - nuove opere","Sì","C1","C1.1",0,"",null,"Pusiano","NO","",2017,"-","-","-","-","-","-","-",null,null,null,null,null,null,null,null,0,0,162900,0,0,0,0,0,162900,0]
[null,"202.13193.1","Pusiano_RETI FOGNARIE - manutenzione straordinaria (LOTTO 1)","No","C2","C2.1",0,"",null,"Pusiano","NO","",2017,"-","-","-","-","-","-","-",null,null,null,null,null,null,null,null,0,0,7086.2,0,0,0,0,0,7086.2,0]
[null,"203.13194.1","Ramponio Verna_RETI FOGNARIE - Mappatura / Ricerche perdite / Studi - Agglomerato 1","Sì","K1","K1.1",476635,"",null,"Ramponio Verna","NO","",2017,"-","-","-",100,"-","-","-",null,null,null,null,null,null,null,null,0,0,9750,0,0,0,0,0,9750,0]
[null,"203.13194.2","Ramponio Verna_RETI FOGNARIE - Mappatura / Ricerche perdite / Studi - Agglomerato 2","Sì","K1","K1.1",476635,"",null,"Ramponio Verna","NO","",2017,"-","-","-",100,"-","-","-",null,null,null,null,null,null,null,null,0,0,9750,0,0,0,0,0,9750,0]
[null,"110.13195.1","Rezzago_RETE DI DISTRIBUZIONE - manutenzione straordinaria / rifacimenti (LOTTO 1)","No","B4","B4.1",10044,"",null,"Rezzago","NO","",2017,"-","-","-","-","-","-","-",null,null,null,null,null,null,null,null,0,0,1358.76,0,0,0,0,0,1358.76,0]
[null,"107.13195.1","Rezzago_RICERCA PERDITE / MAPPATURA RETE / STUDI","Sì","K1","K1.1",508066,"",null,"Rezzago","N.A.","",2017,"-","-","-",100,"-","-","-",null,null,null,null,null,null,null,null,0,0,9750,0,0,0,0,0,9750,0]
[null,"202.13195.1","Rezzago_RETI FOGNARIE - manutenzione straordinaria (LOTTO 1)","No","C2","C2.1",0,"",null,"Rezzago","NO","",2017,"-","-","-","-","-","-","-",null,null,null,null,null,null,null,null,0,0,3066.21,0,0,0,0,0,3066.21,0]
[null,"203.13195.1","Rezzago_RETI FOGNARIE - Mappatura / Ricerche perdite / Studi","Sì","K1","K1.1",476635,"",null,"Rezzago","NO","",2017,"-","-","-",100,"-","-","-",null,null,null,null,null,null,null,null,0,0,9750,0,0,0,0,0,9750,0]
[null,"204.13195.1","Rezzago_RETI FOGNARIE - Separazione reti miste - nuove opere (LOTTO 1)","No","C4","C4.1",0,"",null,"Rezzago","NO","",2017,"-","-","-","massimo 1 episodio ogni 2 km di rete fognaria presenti nel Comune","-","-","-",null,null,null,null,null,null,null,null,0,0,3534.93,0,0,0,0,0,3534.93,0]
[null,"110.13197.1","Rodero_RETE DI DISTRIBUZIONE - manutenzione straordinaria / rifacimenti (LOTTO 1)","No","B4","B4.1",10044,"",null,"Rodero","NO","",2017,"-","-","-","-","-","-","-",null,null,null,null,null,null,null,null,0,0,1809.49,0,0,0,0,0,1809.49,0]
[null,"107.13197.1","Rodero_RICERCA PERDITE / MAPPATURA RETE / STUDI","Sì","K1","K1.1",508066,"",null,"Rodero","N.A.","",2017,"-","-","-",100,"-","-","-",null,null,null,null,null,null,null,null,0,0,9750,0,0,0,0,0,9750,0]
[null,"202.13197.1","Rodero_RETI FOGNARIE - manutenzione straordinaria (LOTTO 1)","No","C2","C2.1",0,"",null,"Rodero","NO","",2017,"-","-","-","-","-","-","-",null,null,null,null,null,null,null,null,0,0,9403.52,0,0,0,0,0,9403.52,0]
[null,"204.13197.1","Rodero_RETI FOGNARIE - Separazione reti miste - nuove opere (LOTTO 1)","No","C4","C4.1",0,"",null,"Rodero","NO","",2017,"-","-","-","massimo 1 episodio ogni 2 km di rete fognaria presenti nel Comune","-","-","-",null,null,null,null,null,null,null,null,0,0,10841,0,0,0,0,0,10841,0]
[null,"206.13197.1","Rodero_SCARICATORI DI PIENA - nuove opere (inserimento / adeguamento paratoie) (LOTTO 1)","No","C4","C4.2",11407,"",null,"Rodero","NO","",2017,"-","-","-","1 episodio/anno per scolmatore","-","-","-",null,null,null,null,null,null,null,null,0,0,633.5,0,0,0,0,0,633.5,0]
[null,"207.13197.1","Rodero_STAZIONI DI SOLLEVAMENTO - manutenzione straordinaria (LOTTO 1)","No","C2","C2.3",4659,"",null,"Rodero","NO","",2017,"-","-","-","-","-","-","-",null,null,null,null,null,null,null,null,0,0,4003.5,0,0,0,0,0,4003.5,0]
[null,"110.13199.1","Ronago_RETE DI DISTRIBUZIONE - manutenzione straordinaria / rifacimenti (LOTTO 1)","No","B4","B4.1",10044,"",null,"Ronago","NO","",2017,"-","-","-","-","-","-","-",null,null,null,null,null,null,null,null,0,0,4280.75,0,0,0,0,0,4280.75,0]
[null,"403.13199.1","COLLEGAMENTO DELLA VASCA DI OSSIDAZIONE CON IL SEDIMENTATORE DELL'IMPIANTO ORIGINARIO","Sì","D2","D2.9",0,"",null,"RONAGO","NO","Studio di fattibilità",2017,"-","-","-","100% giudizi Conformi / Regolamentari","-","-","-",null,null,null,null,null,null,null,null,0,0,75000,0,0,0,0,0,75000,0]
[null,"202.13199.1","Ronago_RETI FOGNARIE - manutenzione straordinaria (LOTTO 1)","No","C2","C2.1",0,"",null,"Ronago","NO","",2017,"-","-","-","-","-","-","-",null,null,null,null,null,null,null,null,0,0,1958.89,0,0,0,0,0,1958.89,0]
[null,"110.13201.1","Rovellasca_RETE DI DISTRIBUZIONE - manutenzione straordinaria / rifacimenti (LOTTO 1)","Sì","B4","B4.1",10044,"",null,"Rovellasca","NO","",2017,"-","-","-","-","-","-","-",null,null,null,null,null,null,null,null,0,0,24124.62,0,0,0,0,0,24124.62,0]
[null,"107.13201.1","Rovellasca_RICERCA PERDITE / MAPPATURA RETE / STUDI","Sì","K1","K1.1",508066,"",null,"Rovellasca","N.A.","",2017,"-","-","-",100,"-","-","-",null,null,null,null,null,null,null,null,0,0,9750,0,0,0,0,0,9750,0]
[null,"202.13201.1","Sostituzione o risanamento strutturale delle tubazioni in fascia di rispetto del pozzo via Manera/Monte Bianco - Intervento 1","No","C2","C2.1",0,"",null,"Rovellasca","NO","Studio di fattibilità",2017,"-","-","-","-","-","-","-",null,null,null,null,null,null,null,null,0,0,114206.25,0,0,0,0,0,114206.25,0]
[null,"203.13201.1","Rovellasca_RETI FOGNARIE - Mappatura / Ricerche perdite / Studi","Sì","K1","K1.1",476635,"",null,"Rovellasca","NO","",2017,"-","-","-",100,"-","-","-",null,null,null,null,null,null,null,null,0,0,7350,0,0,0,0,0,{"$f":"SUM(AC699+AE699+AG699+AI699)","v":7350},{"$f":"SUM(AD699+AF699+AH699+AJ699)","v":0}]
[null,"205.13201.1","Scolmatore 5/C1 - Adeguamento opera civile esistente","No","C4","C4.2",216510,"",null,"Rovellasca","NO","",2017,"-","-","-","1 episodio/anno per scolmatore","-","-","-",null,null,null,null,null,null,null,null,0,0,12000,0,0,0,0,0,12000,0]
[null,"206.13201.1","Scolmatore 1/C1 - Posa regolatore di portata","No","C4","C4.2",11407,"",null,"Rovellasca","NO","",2017,"-","-","-","1 episodio/anno per scolmatore","-","-","-",null,null,null,null,null,null,null,null,0,0,7200,0,0,0,0,0,7200,0]
[null,"206.13201.2","Scolmatore 2/C1-3/C1 - Posa regolatore di portata","No","C4","C4.2",11407,"",null,"Rovellasca","NO","",2017,"-","-","-","1 episodio/anno per scolmatore","-","-","-",null,null,null,null,null,null,null,null,0,0,7200,0,0,0,0,0,7200,0]
[null,"206.13201.3","Scolmatore 4/C1 - Posa regolatore di portata","No","C4","C4.2",11407,"",null,"Rovellasca","NO","",2017,"-","-","-","1 episodio/anno per scolmatore","-","-","-",null,null,null,null,null,null,null,null,0,0,7200,0,0,0,0,0,7200,0]
[null,"206.13201.4","Scolmatore 5/C1 - Posa regolatore di portata","No","C4","C4.2",11407,"",null,"Rovellasca","NO","",2017,"-","-","-","1 episodio/anno per scolmatore","-","-","-",null,null,null,null,null,null,null,null,0,0,7200,0,0,0,0,0,7200,0]
[null,"107.13202.1","Rovello Porro_RICERCA PERDITE / MAPPATURA RETE / STUDI","Sì","K1","K1.1",508066,"",null,"Rovello Porro","N.A.","",2017,"-","-","-",100,"-","-","-",null,null,null,null,null,null,null,null,0,0,9750,0,0,0,0,0,9750,0]
[null,"202.13202.1","Dorsale Premoli e rifacimento scolmatore","No","C2","C2.1",0,"",null,"Rovello Porro","NO","Progetto preliminare",2017,"-","-","-","-","-","-","-",null,null,null,null,null,null,null,null,0,0,349500,0,0,0,0,0,349500,0]
[null,"203.13202.1","Rovello Porro_RETI FOGNARIE - Mappatura / Ricerche perdite / Studi","Sì","K1","K1.1",476635,"",null,"Rovello Porro","NO","",2017,"-","-","-",100,"-","-","-",null,null,null,null,null,null,null,null,0,0,9750,0,0,0,0,0,9750,0]
[null,"206.13202.1","Scolmatore 3/C1 - Posa regolatore di portata","Sì","C4","C4.2",11407,"",null,"Rovello Porro","NO","Studio di fattibilità",2017,"-","-","-","1 episodio/anno per scolmatore","-","-","-",null,null,null,null,null,null,null,null,0,0,6000,0,0,0,0,0,6000,0]
[null,"110.13203.1","Sala Comacina_RETE DI DISTRIBUZIONE - manutenzione straordinaria / rifacimenti (LOTTO 1)","No","B4","B4.1",10044,"",null,"Sala Comacina","NO","",2017,"-","-","-","-","-","-","-",null,null,null,null,null,null,null,null,0,0,3231.93,0,0,0,0,0,3231.93,0]
[null,"202.13203.1","Sala Comacina_RETI FOGNARIE - manutenzione straordinaria (LOTTO 1)","No","C2","C2.1",0,"",null,"Sala Comacina","NO","",2017,"-","-","-","-","-","-","-",null,null,null,null,null,null,null,null,0,0,358.43,0,0,0,0,0,358.43,0]
[null,"203.13203.1","Sala Comacina_RETI FOGNARIE - Mappatura / Ricerche perdite / Studi","Sì","K1","K1.1",476635,"",null,"Sala Comacina","NO","",2017,"-","-","-",100,"-","-","-",null,null,null,null,null,null,null,null,0,0,9750,0,0,0,0,0,9750,0]
[null,"100.13205.1","Allacciamenti alla rete acquedottistica","No","-","-",0,"",null,"San Fedele Intelvi","NO","",2017,"-","-","-","-","-","-","-",null,null,null,null,null,null,null,null,0,0,0,108800,0,0,0,0,0,108800]
[null,"110.13205.1","San Fedele Intelvi_RETE DI DISTRIBUZIONE - manutenzione straordinaria / rifacimenti (LOTTO 1)","No","B4","B4.1",10044,"",null,"San Fedele Intelvi","NO","",2017,"-","-","-","-","-","-","-",null,null,null,null,null,null,null,null,0,0,4371.4399999999996,0,0,0,0,0,4371.4399999999996,0]
[null,"107.13205.1","San Fedele Intelvi_RICERCA PERDITE / MAPPATURA RETE / STUDI","Sì","K1","K1.1",508066,"",null,"San Fedele Intelvi","N.A.","",2017,"-","-","-",100,"-","-","-",null,null,null,null,null,null,null,null,0,0,9750,0,0,0,0,0,9750,0]
[null,"203.13205.1","San Fedele Intelvi_RETI FOGNARIE - Mappatura / Ricerche perdite / Studi","Sì","K1","K1.1",476635,"",null,"San Fedele Intelvi","NO","",2017,"-","-","-",100,"-","-","-",null,null,null,null,null,null,null,null,0,0,9750,0,0,0,0,0,9750,0]
[null,"206.13206.1","San Fermo della Battaglia_SCARICATORI DI PIENA - nuove opere (inserimento / adeguamento paratoie) (LOTTO 1)","No","C4","C4.2",11407,"",null,"San Fermo della Battaglia","NO","",2017,"-","-","-","1 episodio/anno per scolmatore","-","-","-",null,null,null,null,null,null,null,null,0,0,3167.5,0,0,0,0,0,3167.5,0]
[null,"106.13207.1","Ristrutturazione e adeguamento bacino di accumulo presso frazione Cardé","Sì","P2","P2.1",127812,"",null,"San Nazzaro Val Cavargna","NO","Studio di fattibilità",2017,"-","-","-","100% giudizi almeno DISCRETO","-","-","-",null,null,null,null,null,null,null,null,0,0,27150,0,0,0,0,0,27150,0]
[null,"106.13248.1","REALIZZAZIONE DI CLORATORE AD ISOLA ACQUEDOTTO DI CARCENTE","Sì","P2","P2.1",127812,"",null,"San Siro","NO","Studio di fattibilità",2017,"-","-","-","100% giudizi almeno DISCRETO","-","-","-",null,null,null,null,null,null,null,null,0,0,7000,0,0,0,0,0,7000,0]
[null,"202.13248.1","San Siro_RETI FOGNARIE - manutenzione straordinaria (LOTTO 1) - Agglomerato 1","No","C2","C2.1",0,"",null,"San Siro","NO","",2017,"-","-","-","-","-","-","-",null,null,null,null,null,null,null,null,0,0,3621.21,0,0,0,0,0,3621.21,0]
[null,"203.13248.1","San Siro_RETI FOGNARIE - Mappatura / Ricerche perdite / Studi - Agglomerato 1","Sì","K1","K1.1",476635,"",null,"San Siro","NO","",2017,"-","-","-",100,"-","-","-",null,null,null,null,null,null,null,null,0,0,9438,0,0,0,0,0,9438,0]
[null,"203.13248.2","San Siro_RETI FOGNARIE - Mappatura / Ricerche perdite / Studi - Agglomerato 2","Sì","K1","K1.1",476635,"",null,"San Siro","NO","",2017,"-","-","-",100,"-","-","-",null,null,null,null,null,null,null,null,0,0,199.88,0,0,0,0,0,199.88,0]
[null,"203.13248.3","San Siro_RETI FOGNARIE - Mappatura / Ricerche perdite / Studi - Agglomerato 3","Sì","K1","K1.1",476635,"",null,"San Siro","NO","",2017,"-","-","-",100,"-","-","-",null,null,null,null,null,null,null,null,0,0,111.15,0,0,0,0,0,111.15,0]
[null,"100.13211.1","Allacciamenti alla rete acquedottistica","No","-","-",0,"",null,"Schignano","NO","",2017,"-","-","-","-","-","-","-",null,null,null,null,null,null,null,null,0,0,0,192000,0,0,0,0,0,192000]
[null,"200.13211.1","Allacciamenti alla rete fognaria","No","-","-",0,"",null,"Schignano","NO","",2017,"-","-","-","-","-","-","-",null,null,null,null,null,null,null,null,0,0,0,283200,0,0,0,0,0,283200]
[null,"201.13211.3","Opere funzionali alla dismissione del terminale di fognatura n. 3 (ID PROVINCIA 5) (FG01321103)","No","C1","C1.1",0,"",null,"Schignano","NO","",2017,"-","-","-","-","-","-","-",null,null,null,null,null,null,null,null,0,0,100000,0,0,0,0,0,100000,0]
[null,"202.13211.1","Schignano_RETI FOGNARIE - manutenzione straordinaria (LOTTO 1)","No","C2","C2.1",0,"",null,"Schignano","NO","",2017,"-","-","-","-","-","-","-",null,null,null,null,null,null,null,null,0,0,438.03,0,0,0,0,0,438.03,0]
[null,"110.13212.1","Rifacimento reti acquedotto via Olmeda, via Rovelli e razionalizzazione allacciammenti via Canturina Vecchia e via Albate","No","B4","B4.1",10044,"",null,"Senna Comasco","NO","Studio di fattibilità",2017,"-","-","-","-","-","-","-",null,null,null,null,null,null,null,null,0,0,39250,0,0,0,0,0,39250,0]
[null,"107.13212.2","Ricerca e valutazione cause inquinamento da nitrati","No","K1","K1.1",508066,"",null,"Senna Comasco","N.A.","Studio di fattibilità",2017,"-","-","-",100,"-","-","-",null,null,null,null,null,null,null,null,0,0,45000,0,0,0,0,0,45000,0]
[null,"204.13212.1","Senna Comasco_RETI FOGNARIE - Separazione reti miste - nuove opere (LOTTO 1)","No","C4","C4.1",0,"",null,"Senna Comasco","NO","",2017,"-","-","-","massimo 1 episodio ogni 2 km di rete fognaria presenti nel Comune","-","-","-",null,null,null,null,null,null,null,null,0,0,28556.37,0,0,0,0,0,28556.37,0]
[null,"205.13212.1","Senna Comasco_SCARICATORI DI PIENA - manutenzione straordinaria (LOTTO 1)","No","C4","C4.2",216510,"",null,"Senna Comasco","NO","",2017,"-","-","-","1 episodio/anno per scolmatore","-","-","-",null,null,null,null,null,null,null,null,0,0,3925,0,0,0,0,0,3925,0]
[null,"206.13212.1","Senna Comasco_SCARICATORI DI PIENA - nuove opere (inserimento / adeguamento paratoie) (LOTTO 1)","No","C4","C4.2",11407,"",null,"Senna Comasco","NO","",2017,"-","-","-","1 episodio/anno per scolmatore","-","-","-",null,null,null,null,null,null,null,null,0,0,1267,0,0,0,0,0,1267,0]
[null,"107.13215.1","Solbiate_RICERCA PERDITE / MAPPATURA RETE / STUDI","Sì","K1","K1.1",508066,"",null,"Solbiate","N.A.","",2017,"-","-","-",100,"-","-","-",null,null,null,null,null,null,null,null,0,0,9750,0,0,0,0,0,9750,0]
[null,"202.13215.1","Solbiate_RETI FOGNARIE - manutenzione straordinaria (LOTTO 1) - Agglomerato 1","No","C2","C2.1",0,"",null,"Solbiate","NO","",2017,"-","-","-","-","-","-","-",null,null,null,null,null,null,null,null,0,0,5196.63,0,0,0,0,0,5196.63,0]
[null,"202.13215.2","Solbiate_RETI FOGNARIE - manutenzione straordinaria (LOTTO 1) - Agglomerato 2","No","C2","C2.1",0,"",null,"Solbiate","NO","",2017,"-","-","-","-","-","-","-",null,null,null,null,null,null,null,null,0,0,1884.97,0,0,0,0,0,1884.97,0]
[null,"203.13215.1","Solbiate_RETI FOGNARIE - Mappatura / Ricerche perdite / Studi - Agglomerato 1","Sì","K1","K1.1",476635,"",null,"Solbiate","NO","",2017,"-","-","-",100,"-","-","-",null,null,null,null,null,null,null,null,0,0,4201.28,0,0,0,0,0,4201.28,0]
[null,"203.13215.2","Solbiate_RETI FOGNARIE - Mappatura / Ricerche perdite / Studi - Agglomerato 1","Sì","K1","K1.1",476635,"",null,"Solbiate","NO","",2017,"-","-","-",100,"-","-","-",null,null,null,null,null,null,null,null,0,0,1523.93,0,0,0,0,0,1523.93,0]
[null,"203.13215.3","Solbiate_RETI FOGNARIE - Mappatura / Ricerche perdite / Studi - Agglomerato 1","Sì","K1","K1.1",476635,"",null,"Solbiate","NO","",2017,"-","-","-",100,"-","-","-",null,null,null,null,null,null,null,null,0,0,4024.8,0,0,0,0,0,4024.8,0]
[null,"110.13216.1","Sorico_RETE DI DISTRIBUZIONE - manutenzione straordinaria / rifacimenti (LOTTO 1)","No","B4","B4.1",10044,"",null,"Sorico","NO","",2017,"-","-","-","-","-","-","-",null,null,null,null,null,null,null,null,0,0,7219.31,0,0,0,0,0,7219.31,0]
[null,"201.13216.1","COLLETTAMENTO ZONA LA PUNTA","No","C1","C1.1",0,"",null,"Sorico","NO","",2017,"-","-","-","-","-","-","-",null,null,null,null,null,null,null,null,0,0,70000,0,0,0,0,0,70000,0]
[null,"202.13216.1","TRATTO BOSCHETTO FRONTE RISTORANTE BECCACCINO","Sì","C2","C2.1",0,"",null,"SORICO","NO","",2017,"-","-","-","-","-","-","-",null,null,null,null,null,null,null,null,0,0,50000,0,0,0,0,0,50000,0]
[null,"107.13217.1","Verifica perdite di rete","Sì","K1","K1.1",508066,"",null,"Sormano","N.A.","Studio di fattibilità",2017,"-","-","-",100,"-","-","-",null,null,null,null,null,null,null,null,0,0,12480,0,0,0,0,0,12480,0]
[null,"202.13217.1","Sormano_RETI FOGNARIE - manutenzione straordinaria (LOTTO 1)","No","C2","C2.1",0,"",null,"Sormano","NO","",2017,"-","-","-","-","-","-","-",null,null,null,null,null,null,null,null,0,0,6353.79,0,0,0,0,0,6353.79,0]
[null,"202.13218.1","Stazzona_RETI FOGNARIE - manutenzione straordinaria (LOTTO 1)","No","C2","C2.1",0,"",null,"Stazzona","NO","",2017,"-","-","-","-","-","-","-",null,null,null,null,null,null,null,null,0,0,1521.33,0,0,0,0,0,1521.33,0]
[null,"203.13218.1","Stazzona_RETI FOGNARIE - Mappatura / Ricerche perdite / Studi","Sì","K1","K1.1",476635,"",null,"Stazzona","NO","",2017,"-","-","-",100,"-","-","-",null,null,null,null,null,null,null,null,0,0,9750,0,0,0,0,0,9750,0]
[null,"111.13222.1","Serbatoio Ponzate","No","B8","B8.1",0,"",null,"Tavernerio","NO","Progetto preliminare",2017,"-","-","-","-","-","-","-",null,null,null,null,null,null,null,null,0,0,108600,0,0,0,0,0,108600,0]
[null,"203.13222.1","CAMPAGNA RIDUZIONE ACQUE ESTRANEE AI COLLETTORI FOGNARI","No","K1","K1.1",476635,"",null,"Tavernerio","NO","",2017,"-","-","-",100,"-","-","-",null,null,null,null,null,null,null,null,0,0,15000,0,0,0,0,0,15000,0]
[null,"107.13223.1","Torno_RICERCA PERDITE / MAPPATURA RETE / STUDI","Sì","K1","K1.1",508066,"",null,"Torno","N.A.","",2017,"-","-","-",100,"-","-","-",null,null,null,null,null,null,null,null,0,0,9750,0,0,0,0,0,9750,0]
[null,"203.13223.1","Torno_RETI FOGNARIE - Mappatura / Ricerche perdite / Studi","Sì","K1","K1.1",476635,"",null,"Torno","NO","",2017,"-","-","-",100,"-","-","-",null,null,null,null,null,null,null,null,0,0,9750,0,0,0,0,0,9750,0]
[null,"100.13252.1","Allacciamenti alla rete acquedottistica","No","-","-",0,"",null,"Tremezzina","NO","",2017,"-","-","-","-","-","-","-",null,null,null,null,null,null,null,null,0,0,0,14400,0,0,0,0,0,14400]
[null,"102.13252.1","potabilizzazione e recupero sorgenti Casniola ","Sì","A1","A1.1",0,"",null,"Tremezzina","NO","Studio di fattibilità",2017,"-","-","-",0,"-","-","-",null,null,null,null,null,null,null,null,0,0,108600,0,0,0,0,0,108600,0]
[null,"110.13252.2","Manutenzione straordinaria acquedotto comunale","Sì","B4","B4.1",10044,"",null,"Tremezzina","NO","Progetto esecutivo",2017,"-","-","-","-","-","-","-",null,null,null,null,null,null,null,null,0,0,0,102000,0,0,0,0,0,102000]
[null,"107.13252.1","Monitoraggio sorgenti di Rogaro in località Tremezzo per eventuale sfruttamento a fini potabili","No","K1","K1.1",508066,"",null,"Tremezzina","N.A.","Studio di fattibilità",2017,"-","-","-",100,"-","-","-",null,null,null,null,null,null,null,null,0,0,12000,0,0,0,0,0,12000,0]
[null,"107.13252.2","Digitalizzazione rete infrastrutturale: Acquedotto","No","K1","K1.1",508066,"",null,"Tremezzina","N.A.","Progetto preliminare",2017,"-","-","-",100,"-","-","-",null,null,null,null,null,null,null,null,0,0,130000,0,0,0,0,0,130000,0]
[null,"112.13252.1","Realizzazione di un nuovo serbatoio in località \"Acquafredda\" - Lenno","No","B8","B8.1",0,"",null,"Tremezzina","NO","Studio di fattibilità",2017,"-","-","-","-","-","-","-",null,null,null,null,null,null,null,null,0,0,300000,0,0,0,0,0,300000,0]
[null,"201.13252.2","Allacciamento alla pubblica fognatura compendio area Avedo / Villa Balbianello ","No","C1","C1.1",0,150,"rilevata","Tremezzina","NO","Progetto preliminare",2017,"-","-","-","-","-","-","-",null,null,null,null,null,null,null,null,0,0,361834.33,151311.72,0,0,0,0,361834.33,151311.72]
[null,"203.13252.1","Digitalizzazione rete infrastrutturale: Fognatura - Agglomerato 1","Sì","K1","K1.1",476635,"",null,"Tremezzina","NO","",2017,"-","-","-",100,"-","-","-",null,null,null,null,null,null,null,null,0,0,29900,0,0,0,0,0,29900,0]
[null,"203.13252.2","Digitalizzazione rete infrastrutturale: Fognatura - Agglomerato 2","No","K1","K1.1",476635,"",null,"Tremezzina","NO","",2017,"-","-","-",100,"-","-","-",null,null,null,null,null,null,null,null,0,0,100100,0,0,0,0,0,100100,0]
[null,"107.13226.1","Trezzone_RICERCA PERDITE / MAPPATURA RETE / STUDI","Sì","K1","K1.1",508066,"",null,"Trezzone","N.A.","",2017,"-","-","-",100,"-","-","-",null,null,null,null,null,null,null,null,0,0,9750,0,0,0,0,0,9750,0]
[null,"203.13226.1","Trezzone_RETI FOGNARIE - Mappatura / Ricerche perdite / Studi","Sì","K1","K1.1",476635,"",null,"Trezzone","NO","",2017,"-","-","-",100,"-","-","-",null,null,null,null,null,null,null,null,0,0,9750,0,0,0,0,0,9750,0]
[null,"110.13227.1","Turate_RETE DI DISTRIBUZIONE - manutenzione straordinaria / rifacimenti (LOTTO 1)","No","B4","B4.1",10044,"",null,"Turate","NO","",2017,"-","-","-","-","-","-","-",null,null,null,null,null,null,null,null,0,0,3142.25,0,0,0,0,0,3142.25,0]
[null,"203.13227.1","Turate_RETI FOGNARIE - Mappatura / Ricerche perdite / Studi","Sì","K1","K1.1",476635,"",null,"Turate","NO","",2017,"-","-","-",100,"-","-","-",null,null,null,null,null,null,null,null,0,0,9750,0,0,0,0,0,9750,0]
[null,"110.13228.1","Uggiate Trevano_RETE DI DISTRIBUZIONE - manutenzione straordinaria / rifacimenti (LOTTO 1)","No","B4","B4.1",10044,"",null,"Uggiate Trevano","NO","",2017,"-","-","-","-","-","-","-",null,null,null,null,null,null,null,null,0,0,7711.35,0,0,0,0,0,7711.35,0]
[null,"107.13228.1","Uggiate Trevano_RICERCA PERDITE / MAPPATURA RETE / STUDI","Sì","K1","K1.1",508066,"",null,"Uggiate Trevano","N.A.","",2017,"-","-","-",100,"-","-","-",null,null,null,null,null,null,null,null,0,0,9750,0,0,0,0,0,{"$f":"SUM(AC763+AE763+AG763+AI763)","v":9750},{"$f":"SUM(AD763+AF763+AH763+AJ763)","v":0}]
[null,"201.13228.1","REALIZZAZIONE FOGNATURA NERA IN VIA COCQUIO","No","C1","C1.1",0,"",null,"Uggiate Trevano","NO","Studio di fattibilità",2017,"-","-","-","-","-","-","-",null,null,null,null,null,null,null,null,0,0,430000,0,0,0,0,0,430000,0]
[null,"203.13228.1","Uggiate Trevano_RETI FOGNARIE - Mappatura / Ricerche perdite / Studi","Sì","K1","K1.1",476635,"",null,"Uggiate Trevano","NO","",2017,"-","-","-",100,"-","-","-",null,null,null,null,null,null,null,null,0,0,9750,0,0,0,0,0,9750,0]
[null,"204.13228.1","Uggiate Trevano_RETI FOGNARIE - Separazione reti miste - nuove opere (LOTTO 1)","No","C4","C4.1",0,"",null,"Uggiate Trevano","NO","",2017,"-","-","-","massimo 1 episodio ogni 2 km di rete fognaria presenti nel Comune","-","-","-",null,null,null,null,null,null,null,null,0,0,13315.72,0,0,0,0,0,13315.72,0]
[null,"203.13233.1","Val Rezzo_RETI FOGNARIE - Mappatura / Ricerche perdite / Studi - Agglomerato 1","Sì","K1","K1.1",476635,"",null,"Val Rezzo","NO","",2017,"-","-","-",100,"-","-","-",null,null,null,null,null,null,null,null,0,0,5659.88,0,0,0,0,0,5659.88,0]
[null,"203.13233.2","Val Rezzo_RETI FOGNARIE - Mappatura / Ricerche perdite / Studi - Agglomerato 2","Sì","K1","K1.1",476635,"",null,"Val Rezzo","NO","",2017,"-","-","-",100,"-","-","-",null,null,null,null,null,null,null,null,0,0,4090.13,0,0,0,0,0,4090.13,0]
[null,"101.13229.1","Valbrona_Sorgente Visino: manutenzione straordinaria","Sì","A1","A1.4",633,"",null,"Valbrona","NO","Studio di fattibilità",2017,"-","-","-","-","-","-","-",null,null,null,null,null,null,null,null,0,0,15000,0,0,0,0,0,15000,0]
[null,"101.13229.2","Valbrona_Sorgenti: manutenzione straordinaria","Sì","A1","A1.4",633,"",null,"Valbrona","NO","Studio di fattibilità",2017,"-","-","-","-","-","-","-",null,null,null,null,null,null,null,null,0,0,7000,0,0,0,0,0,7000,0]
[null,"107.13229.1","Valbrona_RICERCA PERDITE / MAPPATURA RETE / STUDI","Sì","K1","K1.1",508066,"",null,"Valbrona","N.A.","",2017,"-","-","-",100,"-","-","-",null,null,null,null,null,null,null,null,0,0,9750,0,0,0,0,0,9750,0]
[null,"111.13229.2","Valbrona_Serbatoio  Visino: manutenzione straordinaria","No","B8","B8.1",0,"",null,"Valbrona","NO","Studio di fattibilità",2017,"-","-","-","-","-","-","-",null,null,null,null,null,null,null,null,0,0,25000,0,0,0,0,0,25000,0]
[null,"108.13229.1","Valbrona_TELECONTROLLO","No","K3","K3.1",0,"",null,"Valbrona","N.A.","Studio di fattibilità",2017,"-","-","-","-","-","-","-",null,null,null,null,null,null,null,null,0,0,8000,0,0,0,0,0,8000,0]
[null,"201.13229.1","LOTTO 1 - NUOVA CONDOTTA FOGNARIA VIA VERDI","Sì","C1","C1.1",0,65,"rilevata","Valbrona","NO","Progetto preliminare",2017,"-","-","-","-","-","-","-",null,null,null,null,null,null,null,null,0,0,65838.5,0,0,0,0,0,65838.5,0]
[null,"201.13229.2","LOTTO 2 - NUOVA CONDOTTA FOGNARIA VIA POLASTRI","Sì","C1","C1.1",0,24,"rilevata","Valbrona","NO","Studio di fattibilità",2017,"-","-","-","-","-","-","-",null,null,null,null,null,null,null,null,0,0,50000,0,0,0,0,0,50000,0]
[null,"201.13229.3","LOTTO 3 - NUOVA CONDOTTA FOGNARIA VIA VOLTA","Sì","C1","C1.1",0,12,"rilevata","Valbrona","NO","Studio di fattibilità",2017,"-","-","-","-","-","-","-",null,null,null,null,null,null,null,null,0,0,110000,0,0,0,0,0,110000,0]
[null,"107.13232.1","Valmorea_RICERCA PERDITE / MAPPATURA RETE / STUDI","Sì","K1","K1.1",508066,"",null,"Valmorea","N.A.","",2017,"-","-","-",100,"-","-","-",null,null,null,null,null,null,null,null,0,0,9750,0,0,0,0,0,9750,0]
[null,"202.13232.1","Valmorea_RETI FOGNARIE - manutenzione straordinaria (LOTTO 1)","No","C2","C2.1",0,"",null,"Valmorea","NO","",2017,"-","-","-","-","-","-","-",null,null,null,null,null,null,null,null,0,0,12799.43,0,0,0,0,0,12799.43,0]
[null,"203.13232.1","Valmorea_RETI FOGNARIE - Mappatura / Ricerche perdite / Studi","Sì","K1","K1.1",476635,"",null,"Valmorea","NO","",2017,"-","-","-",100,"-","-","-",null,null,null,null,null,null,null,null,0,0,9750,0,0,0,0,0,9750,0]
[null,"403.13236.1","Scolmatore di piena ingresso impianto","No","D2","D2.9",0,"",null,"Veleso","NO","Progetto preliminare",2017,"-","-","-","100% giudizi Conformi / Regolamentari","-","-","-",null,null,null,null,null,null,null,null,0,0,20000,0,0,0,0,0,20000,0]
[null,"203.13236.1","Veleso_RETI FOGNARIE - Mappatura / Ricerche perdite / Studi","Sì","K1","K1.1",476635,"",null,"Veleso","NO","",2017,"-","-","-",100,"-","-","-",null,null,null,null,null,null,null,null,0,0,9750,0,0,0,0,0,9750,0]
[null,"105.13238.1","Adeguamento impianti di potabilizzazione","No","P2","P2.1",0,"",null,"Veniano","NO","Studio di fattibilità",2017,"-","-","-","100% giudizi almeno DISCRETO","-","-","-",null,null,null,null,null,null,null,null,0,0,58825,0,0,0,0,0,58825,0]
[null,"110.13238.1","Veniano_RETE DI DISTRIBUZIONE - manutenzione straordinaria / rifacimenti (LOTTO 1)","Sì","B4","B4.1",10044,"",null,"Veniano","NO","",2017,"-","-","-","-","-","-","-",null,null,null,null,null,null,null,null,0,0,15307.5,0,0,0,0,0,15307.5,0]
[null,"203.13238.1","Veniano_RETI FOGNARIE - Mappatura / Ricerche perdite / Studi","Sì","K1","K1.1",476635,"",null,"Veniano","NO","",2017,"-","-","-",100,"-","-","-",null,null,null,null,null,null,null,null,0,0,9750,0,0,0,0,0,9750,0]
[null,"110.13239.1","Vercana_RETE DI DISTRIBUZIONE - manutenzione straordinaria / rifacimenti (LOTTO 1)","No","B4","B4.1",10044,"",null,"Vercana","NO","",2017,"-","-","-","-","-","-","-",null,null,null,null,null,null,null,null,0,0,16833.07,0,0,0,0,0,16833.07,0]
[null,"203.13239.1","Vercana_RETI FOGNARIE - Mappatura / Ricerche perdite / Studi","Sì","K1","K1.1",476635,"",null,"Vercana","NO","",2017,"-","-","-",100,"-","-","-",null,null,null,null,null,null,null,null,0,0,9750,0,0,0,0,0,9750,0]
[null,"111.13242.1","Adeguamento impianto di rilancio via Stazione","No","B8","B8.1",0,"",null,"Vertemate con Minoprio","NO","Studio di fattibilità",2017,"-","-","-","-","-","-","-",null,null,null,null,null,null,null,null,0,0,90500,0,0,0,0,0,90500,0]
[null,"203.13242.1","Vertemate con Minoprio_RETI FOGNARIE - Mappatura / Ricerche perdite / Studi","Sì","K1","K1.1",476635,"",null,"Vertemate con Minoprio","NO","",2017,"-","-","-",100,"-","-","-",null,null,null,null,null,null,null,null,0,0,9750,0,0,0,0,0,9750,0]
[null,"110.13245.1","Rifacimento rete acquedotto via Cervino","No","B4","B4.1",10044,"",null,"Villa Guardia","NO","Studio di fattibilità",2017,"-","-","-","-","-","-","-",null,null,null,null,null,null,null,null,0,0,78500,0,0,0,0,0,78500,0]
[null,"202.13245.1","Rifacimento fognatura rmista di via Cervino, P.M. Faverio e Onnis","No","C2","C2.1",0,"",null,"Villa Guardia","NO","Studio di fattibilità",2017,"-","-","-","-","-","-","-",null,null,null,null,null,null,null,null,0,0,515000,0,0,0,0,0,515000,0]
[null,"203.13245.1","mappatura rete fognaria - Agglomerato 1","Sì","K1","K1.1",476635,"",null,"Villa Guardia","NO","Studio di fattibilità",2017,"-","-","-",100,"-","-","-",null,null,null,null,null,null,null,null,0,0,11700,0,0,0,0,0,11700,0]
[null,"203.13245.2","mappatura rete fognaria - Agglomerato 2","No","K1","K1.1",476635,"",null,"Villa Guardia","NO","Studio di fattibilità",2017,"-","-","-",100,"-","-","-",null,null,null,null,null,null,null,null,0,0,13200,0,0,0,0,0,13200,0]
[null,"203.13245.3","mappatura rete fognaria - Agglomerato 3","No","K1","K1.1",476635,"",null,"Villa Guardia","NO","Studio di fattibilità",2017,"-","-","-",100,"-","-","-",null,null,null,null,null,null,null,null,0,0,5100,0,0,0,0,0,5100,0]
[null,"110.13246.1","Zelbio_RETE DI DISTRIBUZIONE - manutenzione straordinaria / rifacimenti (LOTTO 1)","No","B4","B4.1",10044,"",null,"Zelbio","NO","",2017,"-","-","-","-","-","-","-",null,null,null,null,null,null,null,null,0,0,6416.43,0,0,0,0,0,6416.43,0]
[null,"403.13246.1","Realizzazione pozzetto di campionamento","No","D2","D2.9",0,"",null,"Zelbio","NO","Progetto preliminare",2017,"-","-","-","100% giudizi Conformi / Regolamentari","-","-","-",null,null,null,null,null,null,null,null,0,0,8000,0,0,0,0,0,8000,0]
[null,"110.13003.1","Sostituzione reti via ai Campi e via Rufo","Sì","B4","B4.1",10044,"",null,"Albavilla","NO","",2018,"-","-","-","-","-","-","-",null,null,null,null,null,null,null,null,0,0,0,0,94200,0,0,0,94200,0]
[null,"111.13003.1","Serbatoio detto \"Verginella\"","No","B8","B8.1",0,"",null,"Albavilla","NO","",2018,"-","-","-","-","-","-","-",null,null,null,null,null,null,null,null,0,0,0,0,181000,0,0,0,181000,0]
[null,"204.13003.1","SEPARAZIONE RETI BACINO OVEST COMUNE DI ALBAVILLA - lotto 1","No","C4","C4.1",0,"",null,"Albavilla","NO","Progetto preliminare",2018,"-","-","-","-","massimo 1 episodio ogni 2 km di rete fognaria presenti nel Comune","-","-",null,null,null,null,null,null,null,null,0,0,0,0,502057.61,0,0,0,502057.61,0]
[null,"202.13004.1","Albese con Cassano_RETI FOGNARIE - manutenzione straordinaria (LOTTO 1)","No","C2","C2.1",0,"",null,"Albese con Cassano","NO","",2018,"-","-","-","-","-","-","-",null,null,null,null,null,null,null,null,0,0,0,0,22370.32,0,0,0,22370.32,0]
[null,"206.13004.1","Albese con Cassano_SCARICATORI DI PIENA - nuove opere (inserimento / adeguamento paratoie) (prioritario con attivazione immediata)","No","C4","C4.2",11407,"",null,"Albese con Cassano","NO","",2018,"-","-","-","-","1 episodio/anno per scolmatore","-","-",null,null,null,null,null,null,null,null,0,0,0,0,3801,0,0,0,3801,0]
[null,"207.13004.1","Albese con Cassano_STAZIONI DI SOLLEVAMENTO - manutenzione straordinaria (LOTTO 1)","No","C2","C2.3",4659,"",null,"Albese con Cassano","NO","",2018,"-","-","-","-","-","-","-",null,null,null,null,null,null,null,null,0,0,0,0,8007,0,0,0,8007,0]
[null,"110.13005.1","Albiolo_RETE DI DISTRIBUZIONE - manutenzione straordinaria / rifacimenti (LOTTO 1)","No","B4","B4.1",10044,"",null,"Albiolo","NO","",2018,"-","-","-","-","-","-","-",null,null,null,null,null,null,null,null,0,0,0,0,4067.32,0,0,0,4067.32,0]
[null,"204.13005.1","Albiolo_RETI FOGNARIE - Separazione reti miste - nuove opere (LOTTO 1)","No","C4","C4.1",0,"",null,"Albiolo","NO","",2018,"-","-","-","-","massimo 1 episodio ogni 2 km di rete fognaria presenti nel Comune","-","-",null,null,null,null,null,null,null,null,0,0,0,0,13898.09,0,0,0,13898.09,0]
[null,"102.13006.1","SORGENTE ALSERIO (acquedotto Albavilla)","No","A1","A1.1",0,"",null,"Alserio","NO","Progetto preliminare",2018,"-","-","-","-",0,"-","-",null,null,null,null,null,null,null,null,0,0,0,0,30000,0,0,0,30000,0]
[null,"111.13006.1","ADEGUAMENTO LOCALE POMPE DI VIA SORGENTI","No","B8","B8.1",0,"",null,"Alserio","NO","Studio di fattibilità",2018,"-","-","-","-","-","-","-",null,null,null,null,null,null,null,null,0,0,0,0,6000,0,0,0,6000,0]
[null,"202.13006.1","Alserio_RETI FOGNARIE - manutenzione straordinaria (LOTTO 1)","No","C2","C2.1",0,"",null,"Alserio","NO","",2018,"-","-","-","-","-","-","-",null,null,null,null,null,null,null,null,0,0,0,0,7033.21,0,0,0,7033.21,0]
[null,"101.13007.1","REALIZZAZIONE ZTA POZZI \"MIROVANO\" E \"GIOVIO\" E ADEGUAMENTI VARI","No","A1","A1.4",633,"",null,"Alzate Brianza","NO","Studio di fattibilità",2018,"-","-","-","-","-","-","-",null,null,null,null,null,null,null,null,0,0,0,0,20000,0,0,0,20000,0]
[null,"110.13007.1","Alzate Brianza_RETE DI DISTRIBUZIONE - manutenzione straordinaria / rifacimenti (LOTTO 1)","No","B4","B4.1",10044,"",null,"Alzate Brianza","NO","",2018,"-","-","-","-","-","-","-",null,null,null,null,null,null,null,null,0,0,0,0,9776.7800000000007,0,0,0,9776.7800000000007,0]
[null,"202.13007.2","LAVORI DI REALIZZAZIONE DI UN TRONCO DELLA FOGNATURA COMUNALE DI VIA IV NOVEMBRE","No","C2","C2.1",0,"",null,"Alzate Brianza","NO","Studio di fattibilità",2018,"-","-","-","-","-","-","-",null,null,null,null,null,null,null,null,0,0,0,0,300000,0,0,0,300000,0]
[null,"205.13007.1","Alzate Brianza_SCARICATORI DI PIENA - manutenzione straordinaria (LOTTO 1) - AGGLOMERATO 1","No","C4","C4.2",216510,"",null,"Alzate Brianza","NO","",2018,"-","-","-","-","1 episodio/anno per scolmatore","-","-",null,null,null,null,null,null,null,null,0,0,0,0,9812.5,0,0,0,9812.5,0]
[null,"205.13007.1","Alzate Brianza_SCARICATORI DI PIENA - manutenzione straordinaria (LOTTO 1) - AGGLOMERATO 2","No","C4","C4.2",216510,"",null,"Alzate Brianza","NO","",2018,"-","-","-","-","1 episodio/anno per scolmatore","-","-",null,null,null,null,null,null,null,null,0,0,0,0,5887.5,0,0,0,5887.5,0]
[null,"207.13007.1","Alzate Brianza_STAZIONI DI SOLLEVAMENTO - manutenzione straordinaria (LOTTO 1) - AGGLOMERATO 1","No","C2","C2.3",4659,"",null,"Alzate Brianza","NO","",2018,"-","-","-","-","-","-","-",null,null,null,null,null,null,null,null,0,0,0,0,8007,0,0,0,8007,0]
[null,"207.13007.2","Alzate Brianza_STAZIONI DI SOLLEVAMENTO - manutenzione straordinaria (LOTTO 1) - AGGLOMERATO 2","No","C2","C2.3",4659,"",null,"Alzate Brianza","NO","",2018,"-","-","-","-","-","-","-",null,null,null,null,null,null,null,null,0,0,0,0,8007,0,0,0,8007,0]
[null,"110.13009.1","Rifacimento rete via Lazzaretto","Sì","B4","B4.1",10044,"",null,"ANZANO DEL PARCO","NO","Studio di fattibilità",2018,"-","-","-","-","-","-","-",null,null,null,null,null,null,null,null,0,0,0,0,39250,0,0,0,39250,0]
[null,"202.13009.1","Anzano del Parco_RETI FOGNARIE - manutenzione straordinaria (LOTTO 1)","No","C2","C2.1",0,"",null,"Anzano del Parco","NO","",2018,"-","-","-","-","-","-","-",null,null,null,null,null,null,null,null,0,0,0,0,21861.47,0,0,0,21861.47,0]
[null,"102.13010.3","Adeguamento pozzo Mazzini","No","A1","A1.1",0,"",null,"Appiano Gentile","NO","Studio di fattibilità",2018,"-","-","-","-",0,"-","-",null,null,null,null,null,null,null,null,0,0,0,0,153075,0,0,0,153075,0]
[null,"104.13010.1","Perforazione nuovo pozzo ad Appiano Gentile","No","A1","A1.1",60449,"",null,"Appiano Gentile","NO","Studio di fattibilità",2018,"-","-","-","-",0,"-","-",null,null,null,null,null,null,null,null,0,0,0,0,250000,0,0,0,250000,0]
[null,"110.13010.1","Appiano Gentile_RETE DI DISTRIBUZIONE - manutenzione straordinaria / rifacimenti (LOTTO 1)","Sì","B4","B4.1",10044,"",null,"Appiano Gentile","NO","Studio di fattibilità",2018,"-","-","-","-","-","-","-",null,null,null,null,null,null,null,null,0,0,0,0,43371.25,0,0,0,43371.25,0]
[null,"202.13010.1","Appiano Gentile_RETI FOGNARIE - manutenzione straordinaria (LOTTO 1) - AGGLOMERATO 1","No","C2","C2.1",0,"",null,"Appiano Gentile","NO","",2018,"-","-","-","-","-","-","-",null,null,null,null,null,null,null,null,0,0,0,0,33173.71,0,0,0,33173.71,0]
[null,"102.13011.1","PROTEZIONE CATODICA AREA POZZO A LAGO","No","A1","A1.1",0,"",null,"Argegno","NO","",2018,"-","-","-","-",0,"-","-",null,null,null,null,null,null,null,null,0,0,0,0,20000,0,0,0,20000,0]
[null,"110.13011.1","Rifacimento tubazione principale di distribuzione lungo la via Pizzo Gordona","Sì","B4","B4.1",10044,"",null,"ARGEGNO","NO","Studio di fattibilità",2018,"-","-","-","-","-","-","-",null,null,null,null,null,null,null,null,0,0,0,0,40000,0,0,0,40000,0]
[null,"204.13011.2","RETI FOGNARIE - SEPARAZIONE RETI MISTE - NUOVE OPERE - S.P. 15 DAL MUNICIPIO FINO ALLA VIA LUNGO TELO DI SINISTRA","No","C4","C4.1",0,"",null,"Argegno","NO","Progetto preliminare",2018,"-","-","-","-","massimo 1 episodio ogni 2 km di rete fognaria presenti nel Comune","-","-",null,null,null,null,null,null,null,null,0,0,0,0,60000,0,0,0,60000,0]
[null,"110.13012.1","Arosio_RETE DI DISTRIBUZIONE - manutenzione straordinaria / rifacimenti (LOTTO 1)","No","B4","B4.1",10044,"",null,"Arosio","NO","",2018,"-","-","-","-","-","-","-",null,null,null,null,null,null,null,null,0,0,0,0,3885.95,0,0,0,3885.95,0]
[null,"202.13012.1","Arosio_RETI FOGNARIE - manutenzione straordinaria (LOTTO 1) - AGGLOMERATO 1","No","C2","C2.1",0,"",null,"Arosio","NO","",2018,"-","-","-","-","-","-","-",null,null,null,null,null,null,null,null,0,0,0,0,17043,0,0,0,17043,0]
[null,"204.13013.1","Rifacimento tratto fognatura centro storico - I Lotto via Matteotti da via Prato a p.zza Mazzini","No","C4","C4.1",0,"",null,"Asso","NO","Progetto preliminare",2018,"-","-","-","-","massimo 1 episodio ogni 2 km di rete fognaria presenti nel Comune","-","-",null,null,null,null,null,null,null,null,0,0,0,0,425000,0,0,0,425000,0]
[null,"205.13013.1","Asso_SCARICATORI DI PIENA - manutenzione straordinaria (LOTTO 1)","No","C4","C4.2",216510,"",null,"Asso","NO","",2018,"-","-","-","-","1 episodio/anno per scolmatore","-","-",null,null,null,null,null,null,null,null,0,0,0,0,9812.5,0,0,0,9812.5,0]
[null,"202.13015.1","Barni_RETI FOGNARIE - manutenzione straordinaria (LOTTO 1) - AGGLOMERATO 1","No","C2","C2.1",0,"",null,"Barni","NO","",2018,"-","-","-","-","-","-","-",null,null,null,null,null,null,null,null,0,0,0,0,1931.48,0,0,0,{"$f":"SUM(AC827+AE827+AG827+AI827)","v":1931.48},{"$f":"SUM(AD827+AF827+AH827+AJ827)","v":0}]
[null,"100.13019.1","Allacciamenti alla rete acquedottistica","No","-","-",0,"",null,"Bellagio","NO","",2018,"-","-","-","-","-","-","-",null,null,null,null,null,null,null,null,0,0,0,0,0,84800,0,0,0,84800]
[null,"110.13019.1","CIVENNA - Sostituzione tratto di tubazione acquedotto.\nLOTTI H1-H2 e I2 – I3.","Sì","B4","B4.1",10044,"",null,"Bellagio","NO","Progetto preliminare",2018,"-","-","-","-","-","-","-",null,null,null,null,null,null,null,null,0,0,0,0,47100,0,0,0,47100,0]
[null,"111.13019.1","INTERVENTO DI ADEGUAMENTO E POTENZIAMENTO SERBATIOIO IN LOCALITA' VERGONESE IN COMUNE DI BELLAGIO","No","B8","B8.1",0,"",null,"Bellagio","NO","",2018,"-","-","-","-","-","-","-",null,null,null,null,null,null,null,null,0,0,0,0,331000,0,0,0,331000,0]
[null,"200.13019.1","Allacciamenti alla rete fognaria - AGGLOMERATO 2","No","-","-",0,"",null,"Bellagio","NO","",2018,"-","-","-","-","-","-","-",null,null,null,null,null,null,null,null,0,0,0,0,82552.800000000003,42527.199999999997,0,0,82552.800000000003,42527.199999999997]
[null,"200.13019.2","Allacciamenti alla rete fognaria - AGGLOMERATO 3","No","-","-",0,"",null,"Bellagio","NO","",2018,"-","-","-","-","-","-","-",null,null,null,null,null,null,null,null,0,0,0,0,63790.8,61289.2,0,0,63790.8,61289.2]
[null,"200.13019.3","Allacciamenti alla rete fognaria - AGGLOMERATO 4","No","-","-",0,"",null,"Bellagio","NO","",2018,"-","-","-","-","-","-","-",null,null,null,null,null,null,null,null,0,0,0,0,103816.4,21263.599999999999,0,0,103816.4,21263.599999999999]
[null,"201.13019.1","Lavori di collettamento dei reflui urbani Civenna - Oliveto Lario - Parè - lotto H","Sì","C1","C1.1",0,39,"rilevata","Bellagio","NO","Studio di fattibilità",2018,"-","-","-","-","-","-","-",null,null,null,null,null,null,null,null,0,0,0,0,400000,0,0,0,400000,0]
[null,"110.13021.1","Messa in sicurezza tubazione di adduzione dalla fonte Vincì","Sì","B4","B4.1",10044,"",null,"Bene Lario","NO","",2018,"-","-","-","-","-","-","-",null,null,null,null,null,null,null,null,0,0,0,0,27475,0,0,0,27475,0]
[null,"110.13022.1","Rifacimento rete acquedotto via IV novembre e via Garibaldi","Sì","B4","B4.1",10044,"",null,"Beregazzo con Figliaro","NO","Studio di fattibilità",2018,"-","-","-","-","-","-","-",null,null,null,null,null,null,null,null,0,0,0,0,30000,0,0,0,30000,0]
[null,"205.13022.3","Rifacimento collettore consortile in Comune di Beregazzo con Figliaro","No","C4","C4.2",216510,"",null,"Beregazzo con Figliaro","NO","Studio di fattibilità",2018,"-","-","-","-","1 episodio/anno per scolmatore","-","-",null,null,null,null,null,null,null,null,0,0,0,0,1600000,0,0,0,1600000,0]
[null,"207.13022.1","Beregazzo con Figliaro_STAZIONI DI SOLLEVAMENTO - manutenzione straordinaria (LOTTO 1)","No","C2","C2.3",4659,"",null,"Beregazzo con Figliaro","NO","",2018,"-","-","-","-","-","-","-",null,null,null,null,null,null,null,null,0,0,0,0,4003.5,0,0,0,4003.5,0]
[null,"110.13023.1","Binago_RETE DI DISTRIBUZIONE - manutenzione straordinaria / rifacimenti (LOTTO 1)","No","B4","B4.1",10044,"",null,"Binago","NO","",2018,"-","-","-","-","-","-","-",null,null,null,null,null,null,null,null,0,0,0,0,6848.07,0,0,0,6848.07,0]
[null,"206.13023.1","Binago_SCARICATORI DI PIENA - nuove opere (inserimento / adeguamento paratoie) (prioritario con attivazione immediata)","No","C4","C4.2",11407,"",null,"Binago","NO","",2018,"-","-","-","-","1 episodio/anno per scolmatore","-","-",null,null,null,null,null,null,null,null,0,0,0,0,3801,0,0,0,3801,0]
[null,"205.13024.1","Bizzarone_SCARICATORI DI PIENA - manutenzione straordinaria (prioritario con attivazione immediata)","No","C4","C4.2",216510,"",null,"Bizzarone","NO","",2018,"-","-","-","-","1 episodio/anno per scolmatore","-","-",null,null,null,null,null,null,null,null,0,0,0,0,3925,0,0,0,3925,0]
[null,"207.13024.1","Bizzarone_STAZIONI DI SOLLEVAMENTO - manutenzione straordinaria","No","C2","C2.3",4659,"",null,"Bizzarone","NO","",2018,"-","-","-","-","-","-","-",null,null,null,null,null,null,null,null,0,0,0,0,16014,0,0,0,16014,0]
[null,"110.13028.1","Bregnano_RETE DI DISTRIBUZIONE - manutenzione straordinaria / rifacimenti (LOTTO 1)","Sì","B4","B4.1",10044,"",null,"Bregnano","NO","",2018,"-","-","-","-","-","-","-",null,null,null,null,null,null,null,null,0,0,0,0,19389.5,0,0,0,19389.5,0]
[null,"110.13029.1","Brenna_RETE DI DISTRIBUZIONE - manutenzione straordinaria / rifacimenti (LOTTO 1)","No","B4","B4.1",10044,"",null,"Brenna","NO","",2018,"-","-","-","-","-","-","-",null,null,null,null,null,null,null,null,0,0,0,0,2088.1,0,0,0,2088.1,0]
[null,"111.13029.1","MESSA IN SICUREZZA DEGLI IMPIANTI DI SOLLEVAMENTO E ACCUMULO ESISTENTI","No","B8","B8.1",0,"",null,"BRENNA","NO","",2018,"-","-","-","-","-","-","-",null,null,null,null,null,null,null,null,0,0,0,0,31500,0,0,0,31500,0]
[null,"100.13030.1","Allacciamenti alla rete acquedottistica","No","-","-",0,"",null,"Brienno","NO","",2018,"-","-","-","-","-","-","-",null,null,null,null,null,null,null,null,0,0,0,0,0,72000,0,0,0,72000]
[null,"403.13030.1","BRIENNO 1_DEPURATORE ESISTENTE - manutenzione straordinaria complessiva","No","D2","D2.9",0,"",null,"Brienno","NO","",2018,"-","-","-","-","100% giudizi Conformi / Regolamentari","-","-",null,null,null,null,null,null,null,null,0,0,0,0,2512,0,0,0,2512,0]
[null,"403.13030.2","BRIENNO 2_DEPURATORE ESISTENTE - manutenzione straordinaria complessiva","No","D2","D2.9",0,"",null,"Brienno","NO","",2018,"-","-","-","-","100% giudizi Conformi / Regolamentari","-","-",null,null,null,null,null,null,null,null,0,0,0,0,2512,0,0,0,2512,0]
[null,"200.13030.1","Allacciamenti alla rete fognaria","No","-","-",0,"",null,"Brienno","NO","",2018,"-","-","-","-","-","-","-",null,null,null,null,null,null,null,null,0,0,0,0,0,106200,0,0,0,106200]
[null,"201.13030.1","Interventi di adeguamento - estensione - ripristino delle esistenti reti fognarie per risolvere tutte le criticità legate all'attuale assetto della rete fognaria.","No","C1","C1.1",0,113,"rilevata","Brienno","NO","",2018,"-","-","-","-","-","-","-",null,null,null,null,null,null,null,null,0,0,0,0,100000,150000,0,0,100000,150000]
[null,"201.13032.2","Collettore Falchetto","Sì","C1","C1.1",0,"",null,"Brunate","NO","Studio di fattibilità",2018,"-","-","-","-","-","-","-",null,null,null,null,null,null,null,null,0,0,0,0,60000,0,0,0,60000,0]
[null,"202.13032.1","Brunate_RETI FOGNARIE - manutenzione straordinaria (LOTTO 1)","No","C2","C2.1",0,"",null,"Brunate","NO","",2018,"-","-","-","-","-","-","-",null,null,null,null,null,null,null,null,0,0,0,0,2953.64,0,0,0,2953.64,0]
[null,"109.13034.1","Rifacimento allacciamenti ed estensione rete in via Monte rosa - Ravarino - Completamento estensione rete in via Vivaldi / Parco giochi","No","B7","B7.1",0,"",null,"Bulgarograsso","NO","Studio di fattibilità",2018,"-","-","-","-","-","-","-",null,null,null,null,null,null,null,null,0,0,0,0,27150,0,0,0,27150,0]
[null,"205.13034.1","Bulgarograsso_SCARICATORI DI PIENA - manutenzione straordinaria (LOTTO 1)","No","C4","C4.2",216510,"",null,"Bulgarograsso","NO","",2018,"-","-","-","-","1 episodio/anno per scolmatore","-","-",null,null,null,null,null,null,null,null,0,0,0,0,7850,0,0,0,7850,0]
[null,"206.13034.1","Bulgarograsso_SCARICATORI DI PIENA - nuove opere (inserimento / adeguamento paratoie) (LOTTO 1)","No","C4","C4.2",11407,"",null,"Bulgarograsso","NO","",2018,"-","-","-","-","1 episodio/anno per scolmatore","-","-",null,null,null,null,null,null,null,null,0,0,0,0,2534,0,0,0,2534,0]
[null,"202.13035.2","REALIZZAZIONE COLLETTORE E TOMBINATURA IN VIA BUOZZI TRA VIA MEUCCI E VIA G. DI VITTORIO A SALVAGUARDIA POZZO IDRICO","Sì","C2","C2.1",0,"",null,"Cabiate","NO","Studio di fattibilità",2018,"-","-","-","-","-","-","-",null,null,null,null,null,null,null,null,0,0,0,0,200000,0,0,0,200000,0]
[null,"302.13036.1","Dorsale via Volta - Don Nessi","No","C2","C2.1",0,"",null,"Cadorago","NO","Studio di fattibilità",2018,"-","-","-","-","-","-","-",null,null,null,null,null,null,null,null,0,0,0,0,1529312.5,0,0,0,1529312.5,0]
[null,"202.13037.1","Completamento lavori urgenti di rifacimento rete acquedotto e fognatura","No","C2","C2.1",0,"",null,"Caglio",null,"Progetto esecutivo",2018,"-","-","-","-","-","-","-",null,null,null,null,null,null,null,null,0,0,0,0,224000,0,0,0,224000,0]
[null,"204.13037.1","Caglio_RETI FOGNARIE - Separazione reti miste - nuove opere (LOTTO 1)","No","C4","C4.1",0,"",null,"Caglio","NO","",2018,"-","-","-","-","massimo 1 episodio ogni 2 km di rete fognaria presenti nel Comune","-","-",null,null,null,null,null,null,null,null,0,0,0,0,6211.92,0,0,0,6211.92,0]
[null,"205.13037.1","Caglio_SCARICATORI DI PIENA - manutenzione straordinaria (prioritario con attivazione immediata)","No","C4","C4.2",216510,"",null,"Caglio","NO","",2018,"-","-","-","-","1 episodio/anno per scolmatore","-","-",null,null,null,null,null,null,null,null,0,0,0,0,5887.5,0,0,0,5887.5,0]
[null,"206.13037.1","Caglio_SCARICATORI DI PIENA - nuove opere (inserimento / adeguamento paratoie) (prioritario con attivazione immediata)","No","C4","C4.2",11407,"",null,"Caglio","NO","",2018,"-","-","-","-","1 episodio/anno per scolmatore","-","-",null,null,null,null,null,null,null,null,0,0,0,0,1900.5,0,0,0,1900.5,0]
[null,"110.13038.1","REALIZZAZIONE SARACINESCHE PER SEZIONAMENTO RETE IDRICA","Sì","B4","B4.1",10044,"",null,"CAGNO","NO","",2018,"-","-","-","-","-","-","-",null,null,null,null,null,null,null,null,0,0,0,0,15700,0,0,0,15700,0]
[null,"403.13038.1","Cagno_DEPURATORE ESISTENTE - manutenzione straordinaria complessiva (LOTTO 1)","No","D2","D2.9",0,"",null,"Cagno","NO","",2018,"-","-","-","-","100% giudizi Conformi / Regolamentari","-","-",null,null,null,null,null,null,null,null,0,0,0,0,131880,0,0,0,131880,0]
[null,"204.13038.1","Cagno_RETI FOGNARIE - Separazione reti miste - nuove opere (LOTTO 1)","No","C4","C4.1",0,"",null,"Cagno","NO","",2018,"-","-","-","-","massimo 1 episodio ogni 2 km di rete fognaria presenti nel Comune","-","-",null,null,null,null,null,null,null,null,0,0,0,0,8011.97,0,0,0,8011.97,0]
[null,"205.13038.1","Cagno_SCARICATORI DI PIENA - manutenzione straordinaria (prioritario con attivazione immediata)","No","C4","C4.2",216510,"",null,"Cagno","NO","",2018,"-","-","-","-","1 episodio/anno per scolmatore","-","-",null,null,null,null,null,null,null,null,0,0,0,0,1962.5,0,0,0,1962.5,0]
[null,"110.13041.2","SOSTITUZIONE RETE VIA  AGRIGENTO","Sì","B4","B4.1",10044,"",null,"Cantù","NO","Studio di fattibilità",2018,"-","-","-","-","-","-","-",null,null,null,null,null,null,null,null,0,0,0,0,12952.5,0,0,0,12952.5,0]
[null,"202.13041.1","Cantù_RETI FOGNARIE - manutenzione straordinaria (LOTTO 1) - Agglomerato 2","No","C2","C2.1",0,"",null,"Cantù","NO","",2018,"-","-","-","-","-","-","-",null,null,null,null,null,null,null,null,0,0,0,0,22069.45,0,0,0,22069.45,0]
[null,"204.13041.1","Cantù_RETI FOGNARIE - Separazione reti miste - nuove opere (LOTTO 1) - Agglomerato 1","No","C4","C4.1",0,"",null,"Cantù","NO","",2018,"-","-","-","-","massimo 1 episodio ogni 2 km di rete fognaria presenti nel Comune","-","-",null,null,null,null,null,null,null,null,0,0,0,0,130267.56,0,0,0,130267.56,0]
[null,"205.13041.1","Cantù_SCARICATORI DI PIENA - manutenzione straordinaria (LOTTO 1) - Agglomerato 2","No","C4","C4.2",216510,"",null,"Cantù","NO","",2018,"-","-","-","-","1 episodio/anno per scolmatore","-","-",null,null,null,null,null,null,null,null,0,0,0,0,41212.5,0,0,0,41212.5,0]
[null,"206.13041.1","Cantù_SCARICATORI DI PIENA - nuove opere (inserimento / adeguamento paratoie) (LOTTO 1) - Agglomerato 2","No","C4","C4.2",11407,"",null,"Cantù","NO","",2018,"-","-","-","-","1 episodio/anno per scolmatore","-","-",null,null,null,null,null,null,null,null,0,0,0,0,13303.5,0,0,0,13303.5,0]
[null,"105.13042.1","Canzo_Serbatoio Calchera (adeguamento potabilizzazione)","No","P2","P2.1",0,"",null,"Canzo","NO","Progetto preliminare",2018,"-","-","-","-","100% giudizi almeno DISCRETO","-","-",null,null,null,null,null,null,null,null,0,0,0,0,133800,0,0,0,133800,0]
[null,"110.13042.3","Canzo_manutenzione straordinaria reti_via Lunate","Sì","B4","B4.1",10044,"",null,"Canzo","NO","Studio di fattibilità",2018,"-","-","-","-","-","-","-",null,null,null,null,null,null,null,null,0,0,0,0,74000,0,0,0,74000,0]
[null,"202.13042.2","Canzo_reti fognarie_via Lunate (1° lotto)","Sì","C2","C2.1",0,"",null,"Canzo","NO","Studio di fattibilità",2018,"-","-","-","-","-","-","-",null,null,null,null,null,null,null,null,0,0,0,0,170000,0,0,0,170000,0]
[null,"204.13042.1","Canzo_RETI FOGNARIE - Separazione reti miste - nuove opere (LOTTO 1)","No","C4","C4.1",0,"",null,"Canzo","NO","",2018,"-","-","-","-","massimo 1 episodio ogni 2 km di rete fognaria presenti nel Comune","-","-",null,null,null,null,null,null,null,null,0,0,0,0,27050.9,0,0,0,27050.9,0]
[null,"103.13043.2","Sostituzione valvola presso punto consegna Canturina in modo da consentire regolazione della portata in ingresso                   ","No","A1","A1.1",549901,"",null,"Capiago Intimiano","NO","Studio di fattibilità",2018,"-","-","-","-",0,"-","-",null,null,null,null,null,null,null,null,0,0,0,0,9050,0,0,0,9050,0]
[null,"202.13043.1","Rifacimento di un tratto di fognatura collassata in via Pragrasso","Sì","C2","C2.1",0,"",null,"Capiago Intimiano","NO","Studio di fattibilità",2018,"-","-","-","-","-","-","-",null,null,null,null,null,null,null,null,0,0,0,0,75000,0,0,0,75000,0]
[null,"108.13044.1","PONTE RADIO CONTROLLO POMPE","Sì","K3","K3.1",0,"",null,"CARATE URIO","N.A.","",2018,"-","-","-","-","-","-","-",null,null,null,null,null,null,null,null,0,0,0,0,1719.5,0,0,0,1719.5,0]
[null,"109.13045.1","Collegamento tubazioni vie Puccini/Leoncavallo","No","B7","B7.1",0,"",null,"Carbonate","NO","",2018,"-","-","-","-","-","-","-",null,null,null,null,null,null,null,null,0,0,0,0,10000,0,0,0,10000,0]
[null,"109.13045.2","Prolungamento linea pozzo TAFT","No","B7","B7.1",0,"",null,"Carbonate","NO","",2018,"-","-","-","-","-","-","-",null,null,null,null,null,null,null,null,0,0,0,0,28000,0,0,0,28000,0]
[null,"202.13045.1","Carbonate_RETI FOGNARIE - manutenzione straordinaria (LOTTO 1)","No","C2","C2.1",0,"",null,"Carbonate","NO","",2018,"-","-","-","-","-","-","-",null,null,null,null,null,null,null,null,0,0,0,0,22406.65,0,0,0,22406.65,0]
[null,"110.13046.2","Rifacimento collettore centrale seveso","Sì","B4","B4.1",10044,"",null,"Carimate","NO","",2018,"-","-","-","-","-","-","-",null,null,null,null,null,null,null,null,0,0,0,0,7850,0,0,0,7850,0]
[null,"301.13046.1","relining senna comasco","Sì","C2","C2.8",178757,"",null,"Senna Comasco","NO","Progetto esecutivo",2018,"-","-","-","-","-","-","-",null,null,null,null,null,null,null,null,0,0,0,0,200000,0,0,0,200000,0]
[null,"106.13047.1","INSTALLAZIONE IMPIANTI DI CLORAZIONE NEI BACINI MAGGIONE, BARBUTI E SAN PIETRO","Sì","P2","P2.1",127812,"",null,"CARLAZZO","NO","",2018,"-","-","-","-","100% giudizi almeno DISCRETO","-","-",null,null,null,null,null,null,null,null,0,0,0,0,40725,0,0,0,40725,0]
[null,"110.13047.1","SOSTITUZIONE TUBAZIONE ACQUEDOTTO IN VIA PER NAGGIO","Sì","B4","B4.1",10044,"",null,"CARLAZZO","NO","",2018,"-","-","-","-","-","-","-",null,null,null,null,null,null,null,null,0,0,0,0,27475,0,0,0,27475,0]
[null,"403.13047.1","Posizionamento nuovo SAP all'ingresso dell'impianto","No","D2","D2.9",0,"",null,"Carlazzo","NO","Progetto preliminare",2018,"-","-","-","-","100% giudizi Conformi / Regolamentari","-","-",null,null,null,null,null,null,null,null,0,0,0,0,10000,0,0,0,10000,0]
[null,"108.13048.1","INSTALLAZIONE GPRS POZZO RINASCENTE","No","K3","K3.1",0,"",null,"Carugo","N.A.","",2018,"-","-","-","-","-","-","-",null,null,null,null,null,null,null,null,0,0,0,0,452.5,0,0,0,452.5,0]
[null,"201.13048.1","Fognatura Cascina Gattedo","No","C1","C1.1",0,"",null,"Carugo","NO","",2018,"-","-","-","-","-","-","-",null,null,null,null,null,null,null,null,0,0,0,0,40000,0,0,0,40000,0]
[null,"204.13048.1","Carugo_RETI FOGNARIE - Separazione reti miste - nuove opere (LOTTO 1) - Agglomerato 1","No","C4","C4.1",0,"",null,"Carugo","NO","",2018,"-","-","-","-","massimo 1 episodio ogni 2 km di rete fognaria presenti nel Comune","-","-",null,null,null,null,null,null,null,null,0,0,0,0,27281.68,0,0,0,27281.68,0]
[null,"206.13048.1","Carugo_SCARICATORI DI PIENA - nuove opere (inserimento / adeguamento paratoie) (LOTTO 1) - Agglomerato 1","No","C4","C4.2",11407,"",null,"Carugo","NO","",2018,"-","-","-","-","1 episodio/anno per scolmatore","-","-",null,null,null,null,null,null,null,null,0,0,0,0,5068,0,0,0,5068,0]
[null,"207.13048.1","Carugo_STAZIONI DI SOLLEVAMENTO - manutenzione straordinaria (LOTTO 1) - Agglomerato 1","No","C2","C2.3",4659,"",null,"Carugo","NO","",2018,"-","-","-","-","-","-","-",null,null,null,null,null,null,null,null,0,0,0,0,8007,0,0,0,8007,0]
[null,"101.13052.1","Caslino d'Erba_Sorgente Tubi Drenanti: manutenzione straordinaria","No","A1","A1.4",633,"",null,"Caslino d'Erba","NO","Studio di fattibilità",2018,"-","-","-","-","-","-","-",null,null,null,null,null,null,null,null,0,0,0,0,10000,0,0,0,{"$f":"SUM(AC891+AE891+AG891+AI891)","v":10000},{"$f":"SUM(AD891+AF891+AH891+AJ891)","v":0}]
[null,"101.13052.2","Caslino d'Erba_Sorgente Gardée: manutenzione straordinaria","No","A1","A1.4",633,"",null,"Caslino d'Erba","NO","Studio di fattibilità",2018,"-","-","-","-","-","-","-",null,null,null,null,null,null,null,null,0,0,0,0,10000,0,0,0,10000,0]
[null,"102.13052.1","Caslino d'Erba_Sorgente Carrobbio: manutenzione straordinaria","No","A1","A1.1",0,"",null,"Caslino d'Erba","NO","Studio di fattibilità",2018,"-","-","-","-",0,"-","-",null,null,null,null,null,null,null,null,0,0,0,0,4500,0,0,0,4500,0]
[null,"110.13052.1","Caslino d'Erba_manutenzione straordinaria reti_via Cadorna","No","B4","B4.1",10044,"",null,"Caslino d'Erba","NO","Studio di fattibilità",2018,"-","-","-","-","-","-","-",null,null,null,null,null,null,null,null,0,0,0,0,85000,0,0,0,85000,0]
[null,"108.13052.1","Caslino d'Erba_TELECONTROLLO","No","K3","K3.1",0,"",null,"Caslino d'Erba","N.A.","Progetto definitivo",2018,"-","-","-","-","-","-","-",null,null,null,null,null,null,null,null,0,0,0,0,8000,0,0,0,8000,0]
[null,"202.13052.1","Caslino d'Erba_reti fognarie_via Cadorna (LOTTO 1)","No","C2","C2.1",0,"",null,"Caslino d'Erba","NO","Studio di fattibilità",2018,"-","-","-","-","-","-","-",null,null,null,null,null,null,null,null,0,0,0,0,125000,0,0,0,125000,0]
[null,"204.13052.1","Caslino d'Erba_reti fognarie_via Quinto Alpini","Sì","C4","C4.1",0,"",null,"Caslino d'Erba","NO","Studio di fattibilità",2018,"-","-","-","-","massimo 1 episodio ogni 2 km di rete fognaria presenti nel Comune","-","-",null,null,null,null,null,null,null,null,0,0,0,0,50000,0,0,0,50000,0]
[null,"204.13053.1","Casnate con Bernate_RETI FOGNARIE - Separazione reti miste - nuove opere (LOTTO 1) - Agglomerato 1","No","C4","C4.1",0,"",null,"Casnate con Bernate","NO","",2018,"-","-","-","-","massimo 1 episodio ogni 2 km di rete fognaria presenti nel Comune","-","-",null,null,null,null,null,null,null,null,0,0,0,0,11555.26,0,0,0,11555.26,0]
[null,"110.13055.1","Adeguamento rete idrica via Roma","No","B4","B4.1",10044,"",null,"Cassina Rizzardi","NO","Studio di fattibilità",2018,"-","-","-","-","-","-","-",null,null,null,null,null,null,null,null,0,0,0,0,181000,0,0,0,181000,0]
[null,"202.13055.1","Verifica e adeguameto tratto di fognatura di via Roma","Sì","C2","C2.1",0,"",null,"Cassina Rizzardi","NO","Studio di fattibilità",2018,"-","-","-","-","-","-","-",null,null,null,null,null,null,null,null,0,0,0,0,150000,0,0,0,150000,0]
[null,"205.13055.1","Cassina Rizzardi_SCARICATORI DI PIENA - manutenzione straordinaria (LOTTO 1)","No","C4","C4.2",216510,"",null,"Cassina Rizzardi","NO","",2018,"-","-","-","-","1 episodio/anno per scolmatore","-","-",null,null,null,null,null,null,null,null,0,0,0,0,9812.5,0,0,0,9812.5,0]
[null,"206.13055.1","Cassina Rizzardi_SCARICATORI DI PIENA - nuove opere (inserimento / adeguamento paratoie) (LOTTO 1)","No","C4","C4.2",11407,"",null,"Cassina Rizzardi","NO","",2018,"-","-","-","-","1 episodio/anno per scolmatore","-","-",null,null,null,null,null,null,null,null,0,0,0,0,3167.5,0,0,0,3167.5,0]
[null,"202.13058.1","Castelmarte_RETI FOGNARIE - manutenzione straordinaria (LOTTO 1)","No","C2","C2.1",0,"",null,"Castelmarte","NO","",2018,"-","-","-","-","-","-","-",null,null,null,null,null,null,null,null,0,0,0,0,12535.67,0,0,0,12535.67,0]
[null,"202.13059.1","Castelnuovo Bozzente_RETI FOGNARIE - manutenzione straordinaria (LOTTO 1)","No","C2","C2.1",0,"",null,"Castelnuovo Bozzente","NO","",2018,"-","-","-","-","-","-","-",null,null,null,null,null,null,null,null,0,0,0,0,11428.5,0,0,0,11428.5,0]
[null,"110.13061.1","Cavallasca_RETE DI DISTRIBUZIONE - manutenzione straordinaria / rifacimenti (LOTTO 1)","No","B4","B4.1",10044,"",null,"Cavallasca","NO","",2018,"-","-","-","-","-","-","-",null,null,null,null,null,null,null,null,0,0,0,0,2752.74,0,0,0,2752.74,0]
[null,"202.13061.1","Cavallasca_RETI FOGNARIE - manutenzione straordinaria (LOTTO 1) - AGGLOMERATO 1","No","C2","C2.1",0,"",null,"Cavallasca","NO","",2018,"-","-","-","-","-","-","-",null,null,null,null,null,null,null,null,0,0,0,0,1168.3599999999999,0,0,0,1168.3599999999999,0]
[null,"202.13061.1","Cavallasca_RETI FOGNARIE - manutenzione straordinaria (LOTTO 1) - AGGLOMERATO 2","No","C2","C2.1",0,"",null,"Cavallasca","NO","",2018,"-","-","-","-","-","-","-",null,null,null,null,null,null,null,null,0,0,0,0,13621.04,0,0,0,13621.04,0]
[null,"110.13063.1","Cerano d'Intelvi_RETE DI DISTRIBUZIONE - manutenzione straordinaria / rifacimenti (LOTTO 1)","No","B4","B4.1",10044,"",null,"Cerano d'Intelvi","NO","",2018,"-","-","-","-","-","-","-",null,null,null,null,null,null,null,null,0,0,0,0,3754.11,0,0,0,3754.11,0]
[null,"111.13064.1","Adeguamento del serbatoio esistente in zona via I Maggio","No","B8","B8.1",0,"",null,"Cermenate","NO","Studio di fattibilità",2018,"-","-","-","-","-","-","-",null,null,null,null,null,null,null,null,0,0,0,0,235300,0,0,0,235300,0]
[null,"202.13064.2","condotte in fascia di rispetto pozzo via Petrarca","No","C2","C2.1",0,"",null,"Cermenate","NO","Studio di fattibilità",2018,"-","-","-","-","-","-","-",null,null,null,null,null,null,null,null,0,0,0,0,383625,0,0,0,383625,0]
[null,"202.13065.1","Cernobbio_RETI FOGNARIE - manutenzione straordinaria (LOTTO 1)","No","C2","C2.1",0,"",null,"Cernobbio","NO","",2018,"-","-","-","-","-","-","-",null,null,null,null,null,null,null,null,0,0,0,0,4129.0200000000004,0,0,0,4129.0200000000004,0]
[null,"110.13068.1","Cirimido_RETE DI DISTRIBUZIONE - manutenzione straordinaria / rifacimenti (LOTTO 1)","Sì","B4","B4.1",10044,"",null,"Cirimido","NO","Studio di fattibilità",2018,"-","-","-","-","-","-","-",null,null,null,null,null,null,null,null,0,0,0,0,12552.15,0,0,0,12552.15,0]
[null,"204.13068.1","Cirimido_RETI FOGNARIE - Separazione reti miste - nuove opere (LOTTO 1)","No","C4","C4.1",0,"",null,"Cirimido","NO","",2018,"-","-","-","-","massimo 1 episodio ogni 2 km di rete fognaria presenti nel Comune","-","-",null,null,null,null,null,null,null,null,0,0,0,0,17735.740000000002,0,0,0,17735.740000000002,0]
[null,"205.13068.1","Cirimido_SCARICATORI DI PIENA - manutenzione straordinaria (prioritario con attivazione immediata)","No","C4","C4.2",216510,"",null,"Cirimido","NO","",2018,"-","-","-","-","1 episodio/anno per scolmatore","-","-",null,null,null,null,null,null,null,null,0,0,0,0,3925,0,0,0,3925,0]
[null,"206.13068.1","Cirimido_SCARICATORI DI PIENA - nuove opere (inserimento / adeguamento paratoie) (prioritario con attivazione immediata)","No","C4","C4.2",11407,"",null,"Cirimido","NO","",2018,"-","-","-","-","1 episodio/anno per scolmatore","-","-",null,null,null,null,null,null,null,null,0,0,0,0,1267,0,0,0,1267,0]
[null,"403.13071.1","Claino con Osteno_DEPURATORE ESISTENTE - manutenzione straordinaria complessiva (LOTTO 1)","No","D2","D2.9",0,"",null,"Claino con Osteno","NO","",2018,"-","-","-","-","100% giudizi Conformi / Regolamentari","-","-",null,null,null,null,null,null,null,null,0,0,0,0,7536,0,0,0,7536,0]
[null,"403.13074.1","Posa gru a bandiera ","No","D2","D2.9",0,"",null,"Colonno","NO","Progetto preliminare",2018,"-","-","-","-","100% giudizi Conformi / Regolamentari","-","-",null,null,null,null,null,null,null,null,0,0,0,0,50000,0,0,0,50000,0]
[null,"202.13074.1","Colonno_RETI FOGNARIE - manutenzione straordinaria (LOTTO 1)","No","C2","C2.1",0,"",null,"Colonno","NO","",2018,"-","-","-","-","-","-","-",null,null,null,null,null,null,null,null,0,0,0,0,698.73,0,0,0,698.73,0]
[null,"103.13251.1","realizzazione di tubazione in PEAD di collegamento tra il collettore consortile CAISCAP e la rete di adduzione della frazione di Drezzo","No","A1","A1.1",549901,"",null,"Colverde","NO","Progetto preliminare",2018,"-","-","-","-",0,"-","-",null,null,null,null,null,null,null,null,0,0,0,0,228600,0,0,0,228600,0]
[null,"202.13251.2","Colverde_RETI FOGNARIE - manutenzione straordinaria  (LOTTO 1) - AGGLOMERATO 1","No","C2","C2.1",0,"",null,"Colverde","NO","",2018,"-","-","-","-","-","-","-",null,null,null,null,null,null,null,null,0,0,0,0,12626.56,0,0,0,12626.56,0]
[null,"202.13075.3","Fognatura nera via Rezia","Sì","C2","C2.1",0,"",null,"Como","NO","",2018,"-","-","-","-","-","-","-",null,null,null,null,null,null,null,null,0,0,0,0,70000,0,0,0,70000,0]
[null,"204.13075.2","Fognatura nera via Giulini","Sì","C4","C4.1",0,"",null,"Como","NO","",2018,"-","-","-","-","massimo 1 episodio ogni 2 km di rete fognaria presenti nel Comune","-","-",null,null,null,null,null,null,null,null,0,0,0,0,50000,0,0,0,50000,0]
[null,"204.13075.3","Fognatura nera via S. Elia","Sì","C4","C4.1",0,"",null,"Como","NO","",2018,"-","-","-","-","massimo 1 episodio ogni 2 km di rete fognaria presenti nel Comune","-","-",null,null,null,null,null,null,null,null,0,0,0,0,50000,0,0,0,50000,0]
[null,"207.13075.3","Manutenzione straordinaria stazioni di sollevamento e dissabbiatori - intervento 3","No","C2","C2.3",4659,"",null,"Como","NO","",2018,"-","-","-","-","-","-","-",null,null,null,null,null,null,null,null,0,0,0,0,50000,0,0,0,50000,0]
[null,"105.13077.1","IMPIANTO DI POTABILIZZAZIONE ACQUEDOTTO PRESSO BACINO SALEA","No","P2","P2.1",0,"",null,"Corrido","NO","Progetto preliminare",2018,"-","-","-","-","100% giudizi almeno DISCRETO","-","-",null,null,null,null,null,null,null,null,0,0,0,0,35000,0,0,0,35000,0]
[null,"110.13077.3","MANUTENZIONE STRAORDINARIA CONDOTTA IDRICA LOCALITA' CANCELLINO","Sì","B4","B4.1",10044,"",null,"Corrido","NO","",2018,"-","-","-","-","-","-","-",null,null,null,null,null,null,null,null,0,0,0,0,10000,0,0,0,10000,0]
[null,"403.13083.2","Trattamenti biologici - impermeabilizzazione vasche sedimentazione","No","D2","D2.9",0,"",null,"Cremia","NO","Progetto preliminare",2018,"-","-","-","-","100% giudizi Conformi / Regolamentari","-","-",null,null,null,null,null,null,null,null,0,0,0,0,75000,0,0,0,75000,0]
[null,"202.13083.2","Cremia_RETI FOGNARIE - manutenzione straordinaria (LOTTO 1)","No","C2","C2.1",0,"",null,"Cremia","NO","",2018,"-","-","-","-","-","-","-",null,null,null,null,null,null,null,null,0,0,0,0,723.86,0,0,0,723.86,0]
[null,"110.13084.1","Sostituzione saracinesche via Cantù, via Navedano, via Michelbecco, via Volta","No","B4","B4.1",10044,"",null,"Cucciago","NO","Studio di fattibilità",2018,"-","-","-","-","-","-","-",null,null,null,null,null,null,null,null,0,0,0,0,31400,0,0,0,31400,0]
[null,"111.13084.1","Verifica e adeguamento quadri, impianti elettrici e sistema di automazione pompe presso centrale via Navedano e serbatoio pensile","No","B8","B8.1",0,"",null,"Cucciago","NO","Studio di fattibilità",2018,"-","-","-","-","-","-","-",null,null,null,null,null,null,null,null,0,0,0,0,27150,0,0,0,27150,0]
[null,"205.13084.1","Adeguamento scolmatori alla normativa vigente","No","C4","C4.2",216510,"",null,"Cucciago","NO","Studio di fattibilità",2018,"-","-","-","-","1 episodio/anno per scolmatore","-","-",null,null,null,null,null,null,null,null,0,0,0,0,25000,0,0,0,25000,0]
[null,"403.13085.1","Cusino_DEPURATORE ESISTENTE - manutenzione straordinaria complessiva (LOTTO 1)","No","D2","D2.9",0,"",null,"Cusino","NO","",2018,"-","-","-","-","100% giudizi Conformi / Regolamentari","-","-",null,null,null,null,null,null,null,null,0,0,0,0,6280,0,0,0,6280,0]
[null,"403.13085.1","Cusino - Bertogno_DEPURATORE ESISTENTE - manutenzione straordinaria complessiva (LOTTO 1)","No","D2","D2.9",0,"",null,"Cusino","NO","",2018,"-","-","-","-","100% giudizi Conformi / Regolamentari","-","-",null,null,null,null,null,null,null,null,0,0,0,0,3265.6,0,0,0,3265.6,0]
[null,"102.13090.2","Potenziamento sorgenti acquedotto comunale","Sì","A1","A1.1",0,"",null,"Dongo","NO","",2018,"-","-","-","-",0,"-","-",null,null,null,null,null,null,null,null,0,0,0,0,78500,0,0,0,78500,0]
[null,"110.13090.1","Dongo_RETE DI DISTRIBUZIONE - manutenzione straordinaria / rifacimenti (LOTTO 1)","No","B4","B4.1",10044,"",null,"Dongo","NO","",2018,"-","-","-","-","-","-","-",null,null,null,null,null,null,null,null,0,0,0,0,11330.93,0,0,0,11330.93,0]
[null,"102.13095.1","Pozzo Resega - ammodernamento e manutenzione straordinaria","Sì","A1","A1.1",0,"",null,"Erba","NO","Progetto preliminare",2018,"-","-","-","-",0,"-","-",null,null,null,null,null,null,null,null,0,0,0,0,66725,0,0,0,66725,0]
[null,"102.13095.2","Pozzo Carpesino (manutenzione straordinaria)","Sì","A1","A1.1",0,"",null,"Erba","NO","Progetto preliminare",2018,"-","-","-","-",0,"-","-",null,null,null,null,null,null,null,null,0,0,0,0,40035,0,0,0,40035,0]
[null,"102.13095.3","Pozzo Meroni","Sì","A1","A1.1",0,"",null,"Erba","NO","Progetto preliminare",2018,"-","-","-","-",0,"-","-",null,null,null,null,null,null,null,null,0,0,0,0,27475,0,0,0,27475,0]
[null,"105.13095.3","SERBATOIO CANOVA - impianto filtrazione \"Carboni\"","No","P2","P2.1",0,"",null,"Erba","NO","Studio di fattibilità",2018,"-","-","-","-","100% giudizi almeno DISCRETO","-","-",null,null,null,null,null,null,null,null,0,0,0,0,20000,0,0,0,20000,0]
[null,"110.13095.3","CAMERETTA VIA CORTI - VIA LODORINA","Sì","B4","B4.1",10044,"",null,"Erba","NO","Progetto preliminare",2018,"-","-","-","-","-","-","-",null,null,null,null,null,null,null,null,0,0,0,0,55000,0,0,0,55000,0]
[null,"111.13095.1","SERBATOIO CANOVA (impermeabilizzazione e rivestimento vasche)","No","B8","B8.1",0,"",null,"Erba","NO","Progetto preliminare",2018,"-","-","-","-","-","-","-",null,null,null,null,null,null,null,null,0,0,0,0,180000,0,0,0,180000,0]
[null,"202.13095.1","Erba_RETI FOGNARIE - manutenzione straordinaria (LOTTO 1)","No","C2","C2.1",0,"",null,"Erba","NO","",2018,"-","-","-","-","-","-","-",null,null,null,null,null,null,null,null,0,0,0,0,73099.199999999997,0,0,0,73099.199999999997,0]
[null,"205.13095.1","Erba_SCARICATORI DI PIENA - manutenzione straordinaria (prioritario con attivazione immediata)","No","C4","C4.2",216510,"",null,"Erba","NO","",2018,"-","-","-","-","1 episodio/anno per scolmatore","-","-",null,null,null,null,null,null,null,null,0,0,0,0,25512.5,0,0,0,25512.5,0]
[null,"207.13095.1","Erba_STAZIONI DI SOLLEVAMENTO - manutenzione straordinaria (prioritario con attivazione immediata)","No","C2","C2.3",4659,"",null,"Erba","NO","",2018,"-","-","-","-","-","-","-",null,null,null,null,null,null,null,null,0,0,0,0,8007,0,0,0,8007,0]
[null,"110.13097.1","Eupilio_RETE DI DISTRIBUZIONE - manutenzione straordinaria / rifacimenti (LOTTO 1)","No","B4","B4.1",10044,"",null,"Eupilio","NO","",2018,"-","-","-","-","-","-","-",null,null,null,null,null,null,null,null,0,0,0,0,5304.37,0,0,0,5304.37,0]
[null,"202.13097.1","Eupilio_RETI FOGNARIE - manutenzione straordinaria (LOTTO 1)","No","C2","C2.1",0,"",null,"Eupilio","NO","",2018,"-","-","-","-","-","-","-",null,null,null,null,null,null,null,null,0,0,0,0,15645.44,0,0,0,15645.44,0]
[null,"403.13098.1","Interventi di manutenzione","No","D2","D2.9",0,"",null,"Faggeto Lario","NO","Progetto preliminare",2018,"-","-","-","-","100% giudizi Conformi / Regolamentari","-","-",null,null,null,null,null,null,null,null,0,0,0,0,45000,0,0,0,45000,0]
[null,"110.13099.2","Tubazione rete acquedotto (lungo parte della) via Bernaschina","Sì","B4","B4.1",10044,"",null,"FALOPPIO","NO","Studio di fattibilità",2018,"-","-","-","-","-","-","-",null,null,null,null,null,null,null,null,0,0,0,0,10000,0,0,0,10000,0]
[null,"110.13100.1","Fenegrò_RETE DI DISTRIBUZIONE - manutenzione straordinaria / rifacimenti (LOTTO 1)","Sì","B4","B4.1",10044,"",null,"Fenegrò","NO","",2018,"-","-","-","-","-","-","-",null,null,null,null,null,null,null,null,0,0,0,0,20920.25,0,0,0,20920.25,0]
[null,"202.13100.1","Fenegrò_RETI FOGNARIE - manutenzione straordinaria (LOTTO 1)","No","C2","C2.1",0,"",null,"Fenegrò","NO","",2018,"-","-","-","-","-","-","-",null,null,null,null,null,null,null,null,0,0,0,0,21854.400000000001,0,0,0,21854.400000000001,0]
[null,"204.13100.1","Fenegrò_RETI FOGNARIE - Separazione reti miste - nuove opere (LOTTO 1)","No","C4","C4.1",0,"",null,"Fenegrò","NO","",2018,"-","-","-","-","massimo 1 episodio ogni 2 km di rete fognaria presenti nel Comune","-","-",null,null,null,null,null,null,null,null,0,0,0,0,25195.200000000001,0,0,0,25195.200000000001,0]
[null,"205.13100.1","Fenegrò_SCARICATORI DI PIENA - manutenzione straordinaria (prioritario con attivazione immediata)","No","C4","C4.2",216510,"",null,"Fenegrò","NO","",2018,"-","-","-","-","1 episodio/anno per scolmatore","-","-",null,null,null,null,null,null,null,null,0,0,0,0,7850,0,0,0,7850,0]
[null,"110.13101.1","Figino Serenza_RETE DI DISTRIBUZIONE - manutenzione straordinaria / rifacimenti (LOTTO 1)","No","B4","B4.1",10044,"",null,"Figino Serenza","NO","",2018,"-","-","-","-","-","-","-",null,null,null,null,null,null,null,null,0,0,0,0,4692.8599999999997,0,0,0,4692.8599999999997,0]
[null,"202.13101.1","Figino Serenza_RETI FOGNARIE - manutenzione straordinaria (LOTTO 1)","No","C2","C2.1",0,"",null,"Figino Serenza","NO","",2018,"-","-","-","-","-","-","-",null,null,null,null,null,null,null,null,0,0,0,0,30494.9,0,0,0,30494.9,0]
[null,"204.13101.1","Via Adamello. Rifacimento della rete di raccolta ed allontanamento dei reflui fognari e meteorici. ","No","C4","C4.1",0,"",null,"Figino Serenza","NO","",2018,"-","-","-","-","massimo 1 episodio ogni 2 km di rete fognaria presenti nel Comune","-","-",null,null,null,null,null,null,null,null,0,0,0,0,220000,0,0,0,{"$f":"SUM(AC955+AE955+AG955+AI955)","v":220000},{"$f":"SUM(AD955+AF955+AH955+AJ955)","v":0}]
[null,"206.13101.1","Figino Serenza_SCARICATORI DI PIENA - nuove opere (inserimento / adeguamento paratoie) (prioritario con attivazione immediata)","No","C4","C4.2",11407,"",null,"Figino Serenza","NO","",2018,"-","-","-","-","1 episodio/anno per scolmatore","-","-",null,null,null,null,null,null,null,null,0,0,0,0,3801,0,0,0,3801,0]
[null,"110.13102.3","Rifacimento rete acquedotto in via De Amicis","No","B4","B4.1",10044,"",null,"Fino Mornasco","NO","Studio di fattibilità",2018,"-","-","-","-","-","-","-",null,null,null,null,null,null,null,null,0,0,0,0,94200,0,0,0,94200,0]
[null,"403.13102.1","Fino Mornasco - Livescia_DEPURATORE ESISTENTE - manutenzione straordinaria complessiva (LOTTO 1)","No","D2","D2.9",0,"",null,"Fino Mornasco","NO","",2018,"-","-","-","-","100% giudizi Conformi / Regolamentari","-","-",null,null,null,null,null,null,null,null,0,0,0,0,100000,0,0,0,100000,0]
[null,"403.13102.2","Adeguamento sistema di aerazione nitrificazione - seconda sezione","No","D2","D2.9",0,"",null,"Fino Mornasco","NO","Studio di fattibilità",2018,"-","-","-","-","100% giudizi Conformi / Regolamentari","-","-",null,null,null,null,null,null,null,null,0,0,0,0,550000,0,0,0,550000,0]
[null,"302.13102.1","Nuova opera per risanamento del Collettore Consortile \"Alto Seveso\" (LOTTO 1)","No","C2","C2.1",0,"",null,"Fino Mornasco","NO","Progetto preliminare",2018,"-","-","-","-","-","-","-",null,null,null,null,null,null,null,null,0,0,0,0,500000,0,0,0,500000,0]
[null,"201.13102.2","Realizzazione nuova fognatura in via Tevere","No","C1","C1.1",0,"",null,"Fino Mornasco","NO","Studio di fattibilità",2018,"-","-","-","-","-","-","-",null,null,null,null,null,null,null,null,0,0,0,0,80000,0,0,0,80000,0]
[null,"204.13102.1","Fino Mornasco_RETI FOGNARIE - Separazione reti miste - nuove opere (LOTTO 1) - Agglomerato 1","No","C4","C4.1",0,"",null,"Fino Mornasco","NO","",2018,"-","-","-","-","massimo 1 episodio ogni 2 km di rete fognaria presenti nel Comune","-","-",null,null,null,null,null,null,null,null,0,0,0,0,13093.77,0,0,0,13093.77,0]
[null,"204.13102.2","Fino Mornasco_RETI FOGNARIE - Separazione reti miste - nuove opere (LOTTO 1) - Agglomerato 2","No","C4","C4.1",0,"",null,"Fino Mornasco","NO","",2018,"-","-","-","-","massimo 1 episodio ogni 2 km di rete fognaria presenti nel Comune","-","-",null,null,null,null,null,null,null,null,0,0,0,0,8040.27,0,0,0,8040.27,0]
[null,"204.13102.3","Fino Mornasco_RETI FOGNARIE - Separazione reti miste - nuove opere (LOTTO 1) - Agglomerato 3","No","C4","C4.1",0,"",null,"Fino Mornasco","NO","",2018,"-","-","-","-","massimo 1 episodio ogni 2 km di rete fognaria presenti nel Comune","-","-",null,null,null,null,null,null,null,null,0,0,0,0,12350.48,0,0,0,12350.48,0]
[null,"204.13102.4","Fino Mornasco_RETI FOGNARIE - Separazione reti miste - nuove opere (LOTTO 1) - Agglomerato 3","No","C4","C4.1",0,"",null,"Fino Mornasco","NO","",2018,"-","-","-","-","massimo 1 episodio ogni 2 km di rete fognaria presenti nel Comune","-","-",null,null,null,null,null,null,null,null,0,0,0,0,11842.86,0,0,0,11842.86,0]
[null,"207.13102.1","Fino Mornasco_STAZIONI DI SOLLEVAMENTO - manutenzione straordinaria (LOTTO 1) - Agglomerato 3","No","C2","C2.3",4659,"",null,"Fino Mornasco","NO","",2018,"-","-","-","-","-","-","-",null,null,null,null,null,null,null,null,0,0,0,0,4003.5,0,0,0,4003.5,0]
[null,"207.13102.2","Fino Mornasco_STAZIONI DI SOLLEVAMENTO - manutenzione straordinaria (LOTTO 1) - Agglomerato 4","No","C2","C2.3",4659,"",null,"Fino Mornasco","NO","",2018,"-","-","-","-","-","-","-",null,null,null,null,null,null,null,null,0,0,0,0,8007,0,0,0,8007,0]
[null,"401.13106.2","Garzeno_COSTRUZIONE NUOVO IMPIANTO DI DEPURAZIONE E RELATIVI COLLETTORI (LOTTO 2)","Sì","D1","D1.1",0,"",null,"Garzeno","NO","",2018,"-","-","-","-",100,"-","-",null,null,null,null,null,null,null,null,0,0,0,0,450000,0,0,0,450000,0]
[null,"401.13106.3","Garzeno_COSTRUZIONE NUOVO IMPIANTO DI DEPURAZIONE E RELATIVI COLLETTORI (LOTTO 3)","Sì","D1","D1.1",0,"",null,"Garzeno","NO","",2018,"-","-","-","-",100,"-","-",null,null,null,null,null,null,null,null,0,0,0,0,450000,0,0,0,450000,0]
[null,"110.13107.1","Gera Lario_RETE DI DISTRIBUZIONE - manutenzione straordinaria / rifacimenti (LOTTO 1)","No","B4","B4.1",10044,"",null,"Gera Lario","NO","",2018,"-","-","-","-","-","-","-",null,null,null,null,null,null,null,null,0,0,0,0,4656.46,0,0,0,4656.46,0]
[null,"403.13107.1","OPERE URGENTI DI ADEGUAMENTO E MESSA IN SICUREZZA IMPIANTO PRATO ALLUVIONE GERA LARIO","Sì","D2","D2.9",0,"",null,"GERA LARIO","NO","Studio di fattibilità",2018,"-","-","-","-","100% giudizi Conformi / Regolamentari","-","-",null,null,null,null,null,null,null,null,0,0,0,0,60000,0,0,0,60000,0]
[null,"403.13107.2","REALIZZAZIONE AMPLIAMENTO E ADEGUAMENTO IMPIANTO DI DEPURAZIONE GERA LARIO (per servire Sorico, Trezzone e Montemezzo)","No","D2","D2.9",0,"",null,"GERA LARIO","NO","",2018,"-","-","-","-","100% giudizi Conformi / Regolamentari","-","-",null,null,null,null,null,null,null,null,0,0,0,0,1200000,0,0,0,1200000,0]
[null,"110.13110.1","Grandate_RETE DI DISTRIBUZIONE - manutenzione straordinaria / rifacimenti (LOTTO 1)","No","B4","B4.1",10044,"",null,"Grandate","NO","",2018,"-","-","-","-","-","-","-",null,null,null,null,null,null,null,null,0,0,0,0,5998.07,0,0,0,5998.07,0]
[null,"204.13110.1","Grandate_RETI FOGNARIE - Separazione reti miste - nuove opere (LOTTO 1) - Agglomerato 2","No","C4","C4.1",0,"",null,"Grandate","NO","",2018,"-","-","-","-","massimo 1 episodio ogni 2 km di rete fognaria presenti nel Comune","-","-",null,null,null,null,null,null,null,null,0,0,0,0,30185.33,0,0,0,30185.33,0]
[null,"110.13111.1","Grandola ed Uniti_RETE DI DISTRIBUZIONE - manutenzione straordinaria / rifacimenti (LOTTO 1)","No","B4","B4.1",10044,"",null,"Grandola ed Uniti","NO","",2018,"-","-","-","-","-","-","-",null,null,null,null,null,null,null,null,0,0,0,0,10465.86,0,0,0,10465.86,0]
[null,"111.13111.1","REALIZZAZIONE DI NUOVO SERVATOI DI ACCUMOLO IN LOCALITA' OLZERANO","No","B8","B8.1",0,"",null,"Grandola ed Uniti","NO","Progetto preliminare",2018,"-","-","-","-","-","-","-",null,null,null,null,null,null,null,null,0,0,0,0,300000,0,0,0,300000,0]
[null,"202.13111.1","Grandola ed Uniti_RETI FOGNARIE - manutenzione straordinaria (LOTTO 1)","No","C2","C2.1",0,"",null,"Grandola ed Uniti","NO","",2018,"-","-","-","-","-","-","-",null,null,null,null,null,null,null,null,0,0,0,0,1307.5,0,0,0,1307.5,0]
[null,"102.13249.1","Acquisto e messa in opera di nuove pompe di approvigionamento acqua da pozzo di via siberia","No","A1","A1.1",0,"",null,"Gravedona ed Uniti","NO","Progetto preliminare",2018,"-","-","-","-",0,"-","-",null,null,null,null,null,null,null,null,0,0,0,0,50000,0,0,0,50000,0]
[null,"110.13249.1","Rifacimento rete adduttrice Val Calda - Lara","No","B4","B4.1",10044,"",null,"Gravedona ed Uniti","NO","Studio di fattibilità",2018,"-","-","-","-","-","-","-",null,null,null,null,null,null,null,null,0,0,0,0,196250,0,0,0,196250,0]
[null,"403.13249.1","Rifacimento carpenteria Impianto","No","D2","D2.9",0,"",null,"Gravedona ed Uniti","NO","Progetto preliminare",2018,"-","-","-","-","100% giudizi Conformi / Regolamentari","-","-",null,null,null,null,null,null,null,null,0,0,0,0,80000,0,0,0,80000,0]
[null,"110.13113.1","Griante_RETE DI DISTRIBUZIONE - manutenzione straordinaria / rifacimenti (LOTTO 1)","No","B4","B4.1",10044,"",null,"Griante","NO","",2018,"-","-","-","-","-","-","-",null,null,null,null,null,null,null,null,0,0,0,0,3916.38,0,0,0,3916.38,0]
[null,"207.13113.1","rifacimento carpenteria stazioni di sollevamento","No","C2","C2.3",4659,"",null,"Griante","NO","",2018,"-","-","-","-","-","-","-",null,null,null,null,null,null,null,null,0,0,0,0,200000,0,0,0,200000,0]
[null,"101.13114.1","Adeguamento pozzi - intervento 1","No","A1","A1.4",633,"",null,"Guanzate","NO","Studio di fattibilità",2018,"-","-","-","-","-","-","-",null,null,null,null,null,null,null,null,0,0,0,0,58825,0,0,0,58825,0]
[null,"105.13114.1","Adeguamento impianti di potabilizzazione - serbatoio via XX Settembre","No","P2","P2.1",0,"",null,"Guanzate","NO","Studio di fattibilità",2018,"-","-","-","-","100% giudizi almeno DISCRETO","-","-",null,null,null,null,null,null,null,null,0,0,0,0,58825,0,0,0,58825,0]
[null,"110.13114.1","Guanzate_RETE DI DISTRIBUZIONE - manutenzione straordinaria / rifacimenti (LOTTO 1)","Sì","B4","B4.1",10044,"",null,"Guanzate","NO","",2018,"-","-","-","-","-","-","-",null,null,null,null,null,null,null,null,0,0,0,0,34697,0,0,0,34697,0]
[null,"202.13114.2","condotte in fascia di rispetto pozzo via Libertà - Intervento 2","Sì","C2","C2.1",0,"",null,"Guanzate","NO","Studio di fattibilità",2018,"-","-","-","-","-","-","-",null,null,null,null,null,null,null,null,0,0,0,0,190068.5,0,0,0,190068.5,0]
[null,"100.13118.1","Allacciamenti alla rete acquedottistica","No","-","-",0,"",null,"Inverigo","NO","",2018,"-","-","-","-","-","-","-",null,null,null,null,null,null,null,null,0,0,0,0,0,227200,0,0,0,227200]
[null,"200.13118.2","Allacciamenti alla rete fognaria","No","-","-",0,"",null,"Inverigo","NO","",2018,"-","-","-","-","-","-","-",null,null,null,null,null,null,null,null,0,0,0,0,0,28320,0,0,0,28320]
[null,"201.13118.5","FOGNATURA loc. FORNACETTA VIA CATTAFAME","Sì","C1","C1.1",0,30,"rilevata","Inverigo","NO","Studio di fattibilità",2018,"-","-","-","-","-","-","-",null,null,null,null,null,null,null,null,0,0,0,0,55000,0,0,0,55000,0]
[null,"201.13118.6","FOGNATURA VIA MAGISTRI COMACINI","Sì","C1","C1.1",0,20,"rilevata","Inverigo","NO","Studio di fattibilità",2018,"-","-","-","-","-","-","-",null,null,null,null,null,null,null,null,0,0,0,0,70000,0,0,0,70000,0]
[null,"202.13118.2","Inverigo_RETI FOGNARIE - manutenzione straordinaria (LOTTO 1) - Agglomerato 2","No","C2","C2.1",0,"",null,"Inverigo","NO","",2018,"-","-","-","-","-","-","-",null,null,null,null,null,null,null,null,0,0,0,0,2179.54,0,0,0,2179.54,0]
[null,"206.13118.1","Inverigo_SCARICATORI DI PIENA - nuove opere (inserimento / adeguamento paratoie) (LOTTO 1) - Agglomerato 1","No","C4","C4.2",11407,"",null,"Inverigo","NO","",2018,"-","-","-","-","1 episodio/anno per scolmatore","-","-",null,null,null,null,null,null,null,null,0,0,0,0,633.5,0,0,0,633.5,0]
[null,"206.13118.2","Inverigo_SCARICATORI DI PIENA - nuove opere (inserimento / adeguamento paratoie) (LOTTO 1) - Agglomerato 3","No","C4","C4.2",11407,"",null,"Inverigo","NO","",2018,"-","-","-","-","1 episodio/anno per scolmatore","-","-",null,null,null,null,null,null,null,null,0,0,0,0,3801,0,0,0,3801,0]
[null,"207.13118.1","Inverigo_STAZIONI DI SOLLEVAMENTO - manutenzione straordinaria (LOTTO 1) - Agglomerato 3","No","C2","C2.3",4659,"",null,"Inverigo","NO","",2018,"-","-","-","-","-","-","-",null,null,null,null,null,null,null,null,0,0,0,0,4003.5,0,0,0,4003.5,0]
[null,"403.13119.1","Laglio 1_DEPURATORE ESISTENTE - manutenzione straordinaria complessiva","No","D2","D2.9",0,"",null,"Laglio","NO","",2018,"-","-","-","-","100% giudizi Conformi / Regolamentari","-","-",null,null,null,null,null,null,null,null,0,0,0,0,2512,0,0,0,2512,0]
[null,"403.13119.2","Laglio 2_DEPURATORE ESISTENTE - manutenzione straordinaria complessiva","No","D2","D2.9",0,"",null,"Laglio","NO","",2018,"-","-","-","-","100% giudizi Conformi / Regolamentari","-","-",null,null,null,null,null,null,null,null,0,0,0,0,2512,0,0,0,2512,0]
[null,"403.13119.3","Laglio 3_DEPURATORE ESISTENTE - manutenzione straordinaria complessiva","No","D2","D2.9",0,"",null,"Laglio","NO","",2018,"-","-","-","-","100% giudizi Conformi / Regolamentari","-","-",null,null,null,null,null,null,null,null,0,0,0,0,2512,0,0,0,2512,0]
[null,"403.13119.4","Laglio 4_DEPURATORE ESISTENTE - manutenzione straordinaria complessiva","No","D2","D2.9",0,"",null,"Laglio","NO","",2018,"-","-","-","-","100% giudizi Conformi / Regolamentari","-","-",null,null,null,null,null,null,null,null,0,0,0,0,2512,0,0,0,2512,0]
[null,"403.13119.5","Laglio 5_DEPURATORE ESISTENTE - manutenzione straordinaria complessiva","No","D2","D2.9",0,"",null,"Laglio","NO","",2018,"-","-","-","-","100% giudizi Conformi / Regolamentari","-","-",null,null,null,null,null,null,null,null,0,0,0,0,2512,0,0,0,2512,0]
[null,"403.13119.6","Laglio 6_DEPURATORE ESISTENTE - manutenzione straordinaria complessiva","No","D2","D2.9",0,"",null,"Laglio","NO","",2018,"-","-","-","-","100% giudizi Conformi / Regolamentari","-","-",null,null,null,null,null,null,null,null,0,0,0,0,2512,0,0,0,2512,0]
[null,"403.13119.7","Laglio 7_DEPURATORE ESISTENTE - manutenzione straordinaria complessiva","No","D2","D2.9",0,"",null,"Laglio","NO","",2018,"-","-","-","-","100% giudizi Conformi / Regolamentari","-","-",null,null,null,null,null,null,null,null,0,0,0,0,2512,0,0,0,2512,0]
[null,"102.13120.1","Roccolo Borsallo","No","A1","A1.1",0,"",null,"Laino","NO","",2018,"-","-","-","-",0,"-","-",null,null,null,null,null,null,null,null,0,0,0,0,94200,0,0,0,94200,0]
[null,"110.13120.1","Laino_RETE DI DISTRIBUZIONE - manutenzione straordinaria / rifacimenti (LOTTO 1)","No","B4","B4.1",10044,"",null,"Laino","NO","",2018,"-","-","-","-","-","-","-",null,null,null,null,null,null,null,null,0,0,0,0,4155.32,0,0,0,4155.32,0]
[null,"403.13120.1","Laino_DEPURATORE ESISTENTE - manutenzione straordinaria complessiva (LOTTO 1)","No","D2","D2.9",0,"",null,"Laino","NO","",2018,"-","-","-","-","100% giudizi Conformi / Regolamentari","-","-",null,null,null,null,null,null,null,null,0,0,0,0,30144,0,0,0,30144,0]
[null,"110.13121.1","Lambrugo_RETE DI DISTRIBUZIONE - manutenzione straordinaria / rifacimenti (LOTTO 1)","No","B4","B4.1",10044,"",null,"Lambrugo","NO","",2018,"-","-","-","-","-","-","-",null,null,null,null,null,null,null,null,0,0,0,0,9088.4599999999991,0,0,0,9088.4599999999991,0]
[null,"302.13121.1","Ripristino collettore intercomunale Lambrugo-Merone","No","C2","C2.1",0,"",null,"Lambrugo","NO","Studio di fattibilità",2018,"-","-","-","-","-","-","-",null,null,null,null,null,null,null,null,0,0,0,0,350000,0,0,0,350000,0]
[null,"202.13121.1","Lambrugo_RETI FOGNARIE - manutenzione straordinaria (LOTTO 1) - Agglomerato 1","No","C2","C2.1",0,"",null,"Lambrugo","NO","",2018,"-","-","-","-","-","-","-",null,null,null,null,null,null,null,null,0,0,0,0,1374.91,0,0,0,1374.91,0]
[null,"204.13121.1","Lambrugo_RETI FOGNARIE - Separazione reti miste - nuove opere (LOTTO 1) - Agglomerato 2","No","C4","C4.1",0,"",null,"Lambrugo","NO","",2018,"-","-","-","-","massimo 1 episodio ogni 2 km di rete fognaria presenti nel Comune","-","-",null,null,null,null,null,null,null,null,0,0,0,0,15513.99,0,0,0,15513.99,0]
[null,"110.13122.1","Lavori di manutenzione straordinaria della rete idrica comunale di adduzione dalle sorgenti Onizze","Sì","B4","B4.1",10044,"",null,"Lanzo d'Intelvi","NO","Progetto preliminare",2018,"-","-","-","-","-","-","-",null,null,null,null,null,null,null,null,0,0,0,0,23550,0,0,0,23550,0]
[null,"110.13122.2","Lanzo d'Intelvi_RETE DI DISTRIBUZIONE - manutenzione straordinaria / rifacimenti (LOTTO 1)","No","B4","B4.1",10044,"",null,"Lanzo d'Intelvi","NO","",2018,"-","-","-","-","-","-","-",null,null,null,null,null,null,null,null,0,0,0,0,7908.98,0,0,0,7908.98,0]
[null,"202.13122.1","Lanzo d'Intelvi_RETI FOGNARIE - manutenzione straordinaria (LOTTO 1)","No","C2","C2.1",0,"",null,"Lanzo d'Intelvi","NO","",2018,"-","-","-","-","-","-","-",null,null,null,null,null,null,null,null,0,0,0,0,4239,0,0,0,4239,0]
[null,"101.13123.1","Recinzione pozzo S. Alessandro","Sì","A1","A1.4",633,"",null,"LASNIGO","NO","",2018,"-","-","-","-","-","-","-",null,null,null,null,null,null,null,null,0,0,0,0,9050,0,0,0,9050,0]
[null,"110.13123.1","Rifacimento rete idrica via G. Fioroni","No","B4","B4.1",10044,"",null,"LASNIGO","NO","Progetto preliminare",2018,"-","-","-","-","-","-","-",null,null,null,null,null,null,null,null,0,0,0,0,46211.46,0,0,0,46211.46,0]
[null,"202.13126.1","Lezzeno_RETI FOGNARIE - manutenzione straordinaria (LOTTO 1)","No","C2","C2.1",0,"",null,"Lezzeno","NO","",2018,"-","-","-","-","-","-","-",null,null,null,null,null,null,null,null,0,0,0,0,2782.9,0,0,0,2782.9,0]
[null,"110.13128.1","Limido Comasco_RETE DI DISTRIBUZIONE - manutenzione straordinaria / rifacimenti (LOTTO 1)","Sì","B4","B4.1",10044,"",null,"Limido Comasco","NO","Studio di fattibilità",2018,"-","-","-","-","-","-","-",null,null,null,null,null,null,null,null,0,0,0,0,15205.45,0,0,0,15205.45,0]
[null,"403.13128.1","Abbattimento fosforo","No","D2","D2.9",0,"",null,"Limido Comasco","NO","Progetto preliminare",2018,"-","-","-","-","100% giudizi Conformi / Regolamentari","-","-",null,null,null,null,null,null,null,null,0,0,0,0,320000,0,0,0,320000,0]
[null,"205.13128.1","Limido Comasco_SCARICATORI DI PIENA - manutenzione straordinaria (LOTTO 1)","No","C4","C4.2",216510,"",null,"Limido Comasco","NO","",2018,"-","-","-","-","1 episodio/anno per scolmatore","-","-",null,null,null,null,null,null,null,null,0,0,0,0,9812.5,0,0,0,9812.5,0]
[null,"206.13128.1","Limido Comasco_SCARICATORI DI PIENA - nuove opere (inserimento / adeguamento paratoie) (LOTTO 1)","No","C4","C4.2",11407,"",null,"Limido Comasco","NO","",2018,"-","-","-","-","1 episodio/anno per scolmatore","-","-",null,null,null,null,null,null,null,null,0,0,0,0,3167.5,0,0,0,3167.5,0]
[null,"110.13129.1","Rete idrica via Canzighina","No","B4","B4.1",10044,"",null,"Lipomo","NO","Progetto preliminare",2018,"-","-","-","-","-","-","-",null,null,null,null,null,null,null,null,0,0,0,0,62800,0,0,0,{"$f":"SUM(AC1019+AE1019+AG1019+AI1019)","v":62800},{"$f":"SUM(AD1019+AF1019+AH1019+AJ1019)","v":0}]
[null,"110.13131.1","Rifacimento rete via Piave","Sì","B4","B4.1",10044,"",null,"Locate Varesino","NO","",2018,"-","-","-","-","-","-","-",null,null,null,null,null,null,null,null,0,0,0,0,27000,0,0,0,27000,0]
[null,"202.13131.1","Locate Varesino_RETI FOGNARIE - manutenzione straordinaria (LOTTO 1)","No","C2","C2.1",0,"",null,"Locate Varesino","NO","",2018,"-","-","-","-","-","-","-",null,null,null,null,null,null,null,null,0,0,0,0,13691.97,0,0,0,13691.97,0]
[null,"110.13133.1","Lomazzo_RETE DI DISTRIBUZIONE - manutenzione straordinaria / rifacimenti (LOTTO 1)","Sì","B4","B4.1",10044,"",null,"Lomazzo","NO","",2018,"-","-","-","-","-","-","-",null,null,null,null,null,null,null,null,0,0,0,0,42861,0,0,0,42861,0]
[null,"202.13133.4","Realizzazione tubazione di collettamento delle acque derivate dal nuovo manufatto scolmatore 5C1 in frazione Manera da via Piave al collettore consortile secondario di Rovellasca, posata lungo il ciglio della scarpata della valle del Lura","Sì","C2","C2.1",0,"",null,"Lomazzo","NO","Studio di fattibilità",2018,"-","-","-","-","-","-","-",null,null,null,null,null,null,null,null,0,0,0,0,323136,0,0,0,323136,0]
[null,"206.13133.4","Realizzazione nuovo manufatto scolmatore 5C1 in via Piave","No","C4","C4.2",11407,"",null,"Lomazzo","NO","Studio di fattibilità",2018,"-","-","-","-","1 episodio/anno per scolmatore","-","-",null,null,null,null,null,null,null,null,0,0,0,0,30000,0,0,0,30000,0]
[null,"111.13134.1","SERBATOIO SEGRINO - SISTEMAZIONE","No","B8","B8.1",0,"",null,"Longone al Segrino","NO","Progetto preliminare",2018,"-","-","-","-","-","-","-",null,null,null,null,null,null,null,null,0,0,0,0,25000,0,0,0,25000,0]
[null,"111.13135.1","Adeguamento serbatoio pensile","No","B8","B8.1",0,"",null,"Luisago","NO","Studio di fattibilità",2018,"-","-","-","-","-","-","-",null,null,null,null,null,null,null,null,0,0,0,0,45250,0,0,0,45250,0]
[null,"202.13135.1","Luisago_RETI FOGNARIE - manutenzione straordinaria (LOTTO 1)","No","C2","C2.1",0,"",null,"Luisago","NO","",2018,"-","-","-","-","-","-","-",null,null,null,null,null,null,null,null,0,0,0,0,15888.01,0,0,0,15888.01,0]
[null,"110.13136.1","Lurago d'Erba_RETE DI DISTRIBUZIONE - manutenzione straordinaria / rifacimenti (LOTTO 1)","No","B4","B4.1",10044,"",null,"Lurago d'Erba","NO","",2018,"-","-","-","-","-","-","-",null,null,null,null,null,null,null,null,0,0,0,0,9088.4599999999991,0,0,0,9088.4599999999991,0]
[null,"202.13136.1","intervento di manutenzione straordinaria/rifacimento fognatura - intervento 1","Sì","C2","C2.1",0,"",null,"Lurago d'Erba","NO","Studio di fattibilità",2018,"-","-","-","-","-","-","-",null,null,null,null,null,null,null,null,0,0,0,0,40000,0,0,0,40000,0]
[null,"202.13136.2","intervento di manutenzione straordinaria/rifacimento fognatura Via Volta - Via Manzoni - Via Verdi (confine con Comune di Lambrugo)","Sì","C2","C2.1",0,"",null,"Lurago d'Erba","NO","Studio di fattibilità",2018,"-","-","-","-","-","-","-",null,null,null,null,null,null,null,null,0,0,0,0,15000,0,0,0,15000,0]
[null,"206.13137.1","Lurago Marinone_SCARICATORI DI PIENA - nuove opere (inserimento / adeguamento paratoie) (LOTTO 1)","No","C4","C4.2",11407,"",null,"Lurago Marinone","NO","",2018,"-","-","-","-","1 episodio/anno per scolmatore","-","-",null,null,null,null,null,null,null,null,0,0,0,0,1900.5,0,0,0,1900.5,0]
[null,"201.13138.1","Realizzazione tratto di fognatura via Cagnola","No","C1","C1.1",0,12,"rilevata","Lurate Caccivio","NO","Studio di fattibilità",2018,"-","-","-","-","-","-","-",null,null,null,null,null,null,null,null,0,0,0,0,90000,0,0,0,90000,0]
[null,"204.13138.1","Lurate Caccivio_RETI FOGNARIE - Separazione reti miste - nuove opere (LOTTO 1)","No","C4","C4.1",0,"",null,"Lurate Caccivio","NO","",2018,"-","-","-","-","massimo 1 episodio ogni 2 km di rete fognaria presenti nel Comune","-","-",null,null,null,null,null,null,null,null,0,0,0,0,58585.63,0,0,0,58585.63,0]
[null,"205.13138.1","Lurate Caccivio_SCARICATORI DI PIENA - manutenzione straordinaria (prioritario con attivazione immediata)","No","C4","C4.2",216510,"",null,"Lurate Caccivio","NO","",2018,"-","-","-","-","1 episodio/anno per scolmatore","-","-",null,null,null,null,null,null,null,null,0,0,0,0,13737.5,0,0,0,13737.5,0]
[null,"206.13138.1","Lurate Caccivio_SCARICATORI DI PIENA - nuove opere (inserimento / adeguamento paratoie) (prioritario con attivazione immediata)","No","C4","C4.2",11407,"",null,"Lurate Caccivio","NO","",2018,"-","-","-","-","1 episodio/anno per scolmatore","-","-",null,null,null,null,null,null,null,null,0,0,0,0,4434.5,0,0,0,4434.5,0]
[null,"110.13139.1","Magreglio_RETE DI DISTRIBUZIONE - manutenzione straordinaria / rifacimenti (LOTTO 1)","No","B4","B4.1",10044,"",null,"Magreglio","NO","",2018,"-","-","-","-","-","-","-",null,null,null,null,null,null,null,null,0,0,0,0,6241.93,0,0,0,6241.93,0]
[null,"204.13139.1","Magreglio_RETI FOGNARIE - Separazione reti miste - nuove opere (LOTTO 1)","No","C4","C4.1",0,"",null,"Magreglio","NO","",2018,"-","-","-","-","massimo 1 episodio ogni 2 km di rete fognaria presenti nel Comune","-","-",null,null,null,null,null,null,null,null,0,0,0,0,7828.7,0,0,0,7828.7,0]
[null,"403.13143.1","Grigliatura fine a valle della sezione di dissabbiatura","No","D2","D2.9",0,"",null,"Mariano Comense","NO","",2018,"-","-","-","-","100% giudizi Conformi / Regolamentari","-","-",null,null,null,null,null,null,null,null,0,0,0,0,60000,0,0,0,60000,0]
[null,"202.13143.3","Mariano Comense_RETI FOGNARIE - manutenzione straordinaria (LOTTO 1) - Agglomerato 1","No","C2","C2.1",0,"",null,"Mariano Comense","NO","",2018,"-","-","-","-","-","-","-",null,null,null,null,null,null,null,null,0,0,0,0,46691.32,0,0,0,46691.32,0]
[null,"204.13143.1","Mariano Comense_RETI FOGNARIE - Separazione reti miste - nuove opere (LOTTO 1) - Agglomerato 1","No","C4","C4.1",0,"",null,"Mariano Comense","NO","",2018,"-","-","-","-","massimo 1 episodio ogni 2 km di rete fognaria presenti nel Comune","-","-",null,null,null,null,null,null,null,null,0,0,0,0,66703.48,0,0,0,66703.48,0]
[null,"206.13143.1","Mariano Comense_SCARICATORI DI PIENA - nuove opere (inserimento / adeguamento paratoie) (LOTTO 1) - Agglomerato 1","No","C4","C4.2",11407,"",null,"Mariano Comense","NO","",2018,"-","-","-","-","1 episodio/anno per scolmatore","-","-",null,null,null,null,null,null,null,null,0,0,0,0,7602,0,0,0,7602,0]
[null,"204.13144.1","NUOVA LINEA ACQUE NERE - COZZENA - VIA XX SETTEMBRE","No","C4","C4.1",0,"",null,"Maslianico","NO","",2018,"-","-","-","-","massimo 1 episodio ogni 2 km di rete fognaria presenti nel Comune","-","-",null,null,null,null,null,null,null,null,0,0,0,0,200000,0,0,0,200000,0]
[null,"103.13145.1","NUOVO APPROVIGIONAMENTO IDROPOTABILE DALL'ACQUEDOTTO DI MENAGGIO , MEDIANTE INTERCONNESSIONE CON LE RETI DEL COMUNE DI PLESIO ","No","A1","A1.1",549901,"",null,"Menaggio","NO","Progetto preliminare",2018,"-","-","-","-",0,"-","-",null,null,null,null,null,null,null,null,0,0,0,0,160000,0,0,0,160000,0]
[null,"110.13145.1","INTERVENTI DI RAZIONALIZZAZIONE DELLA RETE DISTRIBUTRICE DELL'ACQUEDOTTO COMUNALE ","No","B4","B4.1",10044,"",null,"Menaggio","NO","Progetto preliminare",2018,"-","-","-","-","-","-","-",null,null,null,null,null,null,null,null,0,0,0,0,140000,0,0,0,140000,0]
[null,"404.13147.2","Riduzione delle emissioni odorose - 2°lotto","No","D2","D2.6",0,"",null,"Merone","NO","Studio di fattibilità",2018,"-","-","-","-","-","-","-",null,null,null,null,null,null,null,null,0,0,0,0,172000,0,0,0,172000,0]
[null,"206.13147.1","Merone_SCARICATORI DI PIENA - nuove opere (inserimento / adeguamento paratoie) (LOTTO 1)","No","C4","C4.2",11407,"",null,"Merone","NO","",2018,"-","-","-","-","1 episodio/anno per scolmatore","-","-",null,null,null,null,null,null,null,null,0,0,0,0,1267,0,0,0,1267,0]
[null,"110.13152.1","Moltrasio_RETE DI DISTRIBUZIONE - manutenzione straordinaria / rifacimenti (LOTTO 1)","No","B4","B4.1",10044,"",null,"Moltrasio","NO","",2018,"-","-","-","-","-","-","-",null,null,null,null,null,null,null,null,0,0,0,0,21209.13,0,0,0,21209.13,0]
[null,"111.13152.1","RISANAMENTO SERBATOIO DI TOSNACCO","Sì","B8","B8.1",0,"",null,"Moltrasio","NO","",2018,"-","-","-","-","-","-","-",null,null,null,null,null,null,null,null,0,0,0,0,110000,0,0,0,110000,0]
[null,"111.13154.1","SISTEMAZIONE SERBATOIO PENSILE FAI'","No","B8","B8.1",0,"",null,"Montano Lucino","NO","",2018,"-","-","-","-","-","-","-",null,null,null,null,null,null,null,null,0,0,0,0,50000,0,0,0,50000,0]
[null,"204.13154.1","RISTRUTTURAZIONE RETE FOGNARIA COMUNALE IN VIA VARESINA E VIA OTTONE","No","C4","C4.1",0,"",null,"Montano Lucino","NO","",2018,"-","-","-","-","massimo 1 episodio ogni 2 km di rete fognaria presenti nel Comune","-","-",null,null,null,null,null,null,null,null,0,0,0,0,800000,0,0,0,800000,0]
[null,"205.13154.1","Montano Lucino_SCARICATORI DI PIENA - manutenzione straordinaria (LOTTO 1) - Agglomerato 2","No","C4","C4.2",216510,"",null,"Montano Lucino","NO","",2018,"-","-","-","-","1 episodio/anno per scolmatore","-","-",null,null,null,null,null,null,null,null,0,0,0,0,13737.5,0,0,0,13737.5,0]
[null,"206.13154.1","Montano Lucino_SCARICATORI DI PIENA - nuove opere (inserimento / adeguamento paratoie) (LOTTO 1) - Agglomerato 2","No","C4","C4.2",11407,"",null,"Montano Lucino","NO","",2018,"-","-","-","-","1 episodio/anno per scolmatore","-","-",null,null,null,null,null,null,null,null,0,0,0,0,4434.5,0,0,0,4434.5,0]
[null,"110.13155.1","Montemezzo_RETE DI DISTRIBUZIONE - manutenzione straordinaria / rifacimenti (LOTTO 1)","No","B4","B4.1",10044,"",null,"Montemezzo","NO","",2018,"-","-","-","-","-","-","-",null,null,null,null,null,null,null,null,0,0,0,0,9967.69,0,0,0,9967.69,0]
[null,"110.13157.1","Rifacimento rete via Castrolli, Molera","No","B4","B4.1",10044,"",null,"Montorfano","NO","Studio di fattibilità",2018,"-","-","-","-","-","-","-",null,null,null,null,null,null,null,null,0,0,0,0,117750,0,0,0,117750,0]
[null,"202.13157.1","Adeguamento fognatura lungo la via Como","No","C2","C2.1",0,"",null,"Montorfano","NO","Studio di fattibilità",2018,"-","-","-","-","-","-","-",null,null,null,null,null,null,null,null,0,0,0,0,250000,0,0,0,250000,0]
[null,"207.13157.1","Realizzazione telecontrollo e generatore energia elettrica stazione di sollevamento di via Como","No","C2","C2.3",4659,"",null,"Montorfano","NO","Studio di fattibilità",2018,"-","-","-","-","-","-","-",null,null,null,null,null,null,null,null,0,0,0,0,30000,0,0,0,30000,0]
[null,"110.13159.2","Potenziamento parziale via Gorla","Sì","B4","B4.1",10044,"",null,"Mozzate","NO","",2018,"-","-","-","-","-","-","-",null,null,null,null,null,null,null,null,0,0,0,0,18000,0,0,0,18000,0]
[null,"202.13159.1","VIA TOTI: REALIZZAZIONE E POTENZIAMENTO RETE MISTA","Sì","C2","C2.1",0,"",null,"Mozzate","NO","Studio di fattibilità",2018,"-","-","-","-","-","-","-",null,null,null,null,null,null,null,null,0,0,0,0,135000,0,0,0,135000,0]
[null,"205.13159.1","Mozzate_SCARICATORI DI PIENA - manutenzione straordinaria (prioritario con attivazione immediata)","No","C4","C4.2",216510,"",null,"Mozzate","NO","",2018,"-","-","-","-","1 episodio/anno per scolmatore","-","-",null,null,null,null,null,null,null,null,0,0,0,0,7850,0,0,0,7850,0]
[null,"206.13159.1","Mozzate_SCARICATORI DI PIENA - nuove opere (inserimento / adeguamento paratoie) (prioritario con attivazione immediata)","No","C4","C4.2",11407,"",null,"Mozzate","NO","",2018,"-","-","-","-","1 episodio/anno per scolmatore","-","-",null,null,null,null,null,null,null,null,0,0,0,0,2534,0,0,0,2534,0]
[null,"110.13160.2","ADEGUAMENTO BACINO CAMPAGNANO - Rifacimento adduzione","No","B4","B4.1",10044,"",null,"Musso","NO","",2018,"-","-","-","-","-","-","-",null,null,null,null,null,null,null,null,0,0,0,0,80000,0,0,0,80000,0]
[null,"202.13160.1","Musso_RETI FOGNARIE - manutenzione straordinaria (LOTTO 1)","No","C2","C2.1",0,"",null,"Musso","NO","",2018,"-","-","-","-","-","-","-",null,null,null,null,null,null,null,null,0,0,0,0,2131.5100000000002,0,0,0,2131.5100000000002,0]
[null,"110.13161.1","Nesso_RETE DI DISTRIBUZIONE - manutenzione straordinaria / rifacimenti (LOTTO 1)","No","B4","B4.1",10044,"",null,"Nesso","NO","",2018,"-","-","-","-","-","-","-",null,null,null,null,null,null,null,null,0,0,0,0,2371.04,0,0,0,2371.04,0]
[null,"110.13163.1","Sostituzione tratto rete acquedotto di via F.lli Kennedy","No","B4","B4.1",10044,"",null,"NOVEDRATE","NO","",2018,"-","-","-","-","-","-","-",null,null,null,null,null,null,null,null,0,0,0,0,78500,0,0,0,78500,0]
[null,"110.13163.2","Sostituzione tratto rete acquedotto di via A. Grandi","No","B4","B4.1",10044,"",null,"NOVEDRATE","NO","",2018,"-","-","-","-","-","-","-",null,null,null,null,null,null,null,null,0,0,0,0,47100,0,0,0,47100,0]
[null,"302.13163.1","Adeguamento del tratto terminale del Collettore Alto","No","C2","C2.1",0,"",null,"Novedrate","NO","Progetto preliminare",2018,"-","-","-","-","-","-","-",null,null,null,null,null,null,null,null,0,0,0,0,150000,0,0,0,150000,0]
[null,"205.13163.1","Novedrate_SCARICATORI DI PIENA - manutenzione straordinaria (prioritario con attivazione immediata)","No","C4","C4.2",216510,"",null,"Novedrate","NO","",2018,"-","-","-","-","1 episodio/anno per scolmatore","-","-",null,null,null,null,null,null,null,null,0,0,0,0,9812.5,0,0,0,9812.5,0]
[null,"207.13163.1","Novedrate_STAZIONI DI SOLLEVAMENTO - manutenzione straordinaria (prioritario con attivazione immediata)","No","C2","C2.3",4659,"",null,"Novedrate","NO","",2018,"-","-","-","-","-","-","-",null,null,null,null,null,null,null,null,0,0,0,0,4003.5,0,0,0,4003.5,0]
[null,"110.13165.1","Sostituzione tratti di rete ammalorati o sottodimensionati (LOTTO 1)","Sì","B4","B4.1",10044,"",null,"Olgiate Comasco","NO","",2018,"-","-","-","-","-","-","-",null,null,null,null,null,null,null,null,0,0,0,0,58875,0,0,0,58875,0]
[null,"302.13165.1","Lavori di rifacimento condotte zona Nord in Comune di olgiate Comasco - Lotto A (Via delle Fornaci)","Sì","C2","C2.1",0,"",null,"Olgiate Comasco","NO","Progetto definitivo",2018,"-","-","-","-","-","-","-",null,null,null,null,null,null,null,null,0,0,0,0,2300000,0,0,0,2300000,0]
[null,"110.13169.2","Rifacimento tratto di acquedotto via per Olgiate e via Dominioni Interna","Sì","B4","B4.1",10044,"",null,"Oltrona San Mamette","NO","Studio di fattibilità",2018,"-","-","-","-","-","-","-",null,null,null,null,null,null,null,null,0,0,0,0,27475,0,0,0,27475,0]
[null,"204.13169.1","Oltrona San Mamette_RETI FOGNARIE - Separazione reti miste - nuove opere (LOTTO 1)","No","C4","C4.1",0,"",null,"Oltrona San Mamette","NO","",2018,"-","-","-","-","massimo 1 episodio ogni 2 km di rete fognaria presenti nel Comune","-","-",null,null,null,null,null,null,null,null,0,0,0,0,9100.68,0,0,0,9100.68,0]
[null,"101.13170.1","ZONA TUTELA ASSOLUTA POZZO BOSCO D'AZARA ORSENIGO","No","A1","A1.4",633,"",null,"Orsenigo","NO","",2018,"-","-","-","-","-","-","-",null,null,null,null,null,null,null,null,0,0,0,0,15000,0,0,0,15000,0]
[null,"110.13170.2","RETE IDRICA VIA MARCONI","No","B4","B4.1",10044,"",null,"ORSENIGO","NO","Studio di fattibilità",2018,"-","-","-","-","-","-","-",null,null,null,null,null,null,null,null,0,0,0,0,25000,0,0,0,25000,0]
[null,"110.13170.3","RETE IDRICA VIA BARAGIOLA","No","B4","B4.1",10044,"",null,"ORSENIGO","NO","Studio di fattibilità",2018,"-","-","-","-","-","-","-",null,null,null,null,null,null,null,null,0,0,0,0,30000,0,0,0,30000,0]
[null,"107.13170.1","Studio per adeguamento rete idrica esistente a seguito della prossima espansione edilizia comparto Via Montello Orsenigo","Sì","K1","K1.1",508066,"",null,"Orsenigo","N.A.","Studio di fattibilità",2018,"-","-","-","-",100,"-","-",null,null,null,null,null,null,null,null,0,0,0,0,8000,0,0,0,8000,0]
[null,"202.13170.2","Orsenigo_RETI FOGNARIE - manutenzione straordinaria (LOTTO 1) - Agglomerato 2","No","C2","C2.1",0,"",null,"Orsenigo","NO","",2018,"-","-","-","-","-","-","-",null,null,null,null,null,null,null,null,0,0,0,0,7588.84,0,0,0,7588.84,0]
[null,"204.13170.1","Orsenigo_RETI FOGNARIE - Separazione reti miste - nuove opere (LOTTO 1) - Agglomerato 1","No","C4","C4.1",0,"",null,"Orsenigo","NO","",2018,"-","-","-","-","massimo 1 episodio ogni 2 km di rete fognaria presenti nel Comune","-","-",null,null,null,null,null,null,null,null,0,0,0,0,13030.81,0,0,0,13030.81,0]
[null,"110.13178.2","Peglio_RETE DI DISTRIBUZIONE - manutenzione straordinaria / rifacimenti (LOTTO 1)","No","B4","B4.1",10044,"",null,"Peglio","NO","",2018,"-","-","-","-","-","-","-",null,null,null,null,null,null,null,null,0,0,0,0,14355.3,0,0,0,14355.3,0]
[null,"110.13179.1","Pellio Intelvi_RETE DI DISTRIBUZIONE - manutenzione straordinaria / rifacimenti (LOTTO 1)","No","B4","B4.1",10044,"",null,"Pellio Intelvi","NO","",2018,"-","-","-","-","-","-","-",null,null,null,null,null,null,null,null,0,0,0,0,3317.1,0,0,0,3317.1,0]
[null,"403.13179.1","Adeguamento impianto di depurazione - sedimentatore a pacchi lamellari","No","D2","D2.9",0,"",null,"Pellio Intelvi","NO","Progetto preliminare",2018,"-","-","-","-","100% giudizi Conformi / Regolamentari","-","-",null,null,null,null,null,null,null,null,0,0,0,0,30000,0,0,0,30000,0]
[null,"403.13179.2","Adeguamento impianto di depurazione - razionalizzazione pretrattamenti","No","D2","D2.9",0,"",null,"Pellio Intelvi","NO","",2018,"-","-","-","-","100% giudizi Conformi / Regolamentari","-","-",null,null,null,null,null,null,null,null,0,0,0,0,25000,0,0,0,25000,0]
[null,"202.13179.1","Pellio Intelvi_RETI FOGNARIE - manutenzione straordinaria (LOTTO 1)","No","C2","C2.1",0,"",null,"Pellio Intelvi","NO","",2018,"-","-","-","-","-","-","-",null,null,null,null,null,null,null,null,0,0,0,0,2560.12,0,0,0,{"$f":"SUM(AC1083+AE1083+AG1083+AI1083)","v":2560.12},{"$f":"SUM(AD1083+AF1083+AH1083+AJ1083)","v":0}]
[null,"110.13185.1","Plesio_RETE DI DISTRIBUZIONE - manutenzione straordinaria / rifacimenti (LOTTO 1)","No","B4","B4.1",10044,"",null,"Plesio","NO","",2018,"-","-","-","-","-","-","-",null,null,null,null,null,null,null,null,0,0,0,0,9471.0300000000007,0,0,0,9471.0300000000007,0]
[null,"110.13186.1","Rifacimento tubazione di adduzione da Pozzo a serbatoio (loc. Canzaga)","Sì","B4","B4.1",10044,"",null,"Pognana Lario","NO","",2018,"-","-","-","-","-","-","-",null,null,null,null,null,null,null,null,0,0,0,0,60000,0,0,0,60000,0]
[null,"403.13186.1","Rifacimento tappeto diffusione aria vasca ossidazione","No","D2","D2.9",0,"",null,"Pognana Lario","NO","Progetto preliminare",2018,"-","-","-","-","100% giudizi Conformi / Regolamentari","-","-",null,null,null,null,null,null,null,null,0,0,0,0,15000,0,0,0,15000,0]
[null,"403.13186.2","Opere Edili - Rifacimento Dissabbiatore ","No","D2","D2.9",0,"",null,"Pognana Lario","NO","Progetto preliminare",2018,"-","-","-","-","100% giudizi Conformi / Regolamentari","-","-",null,null,null,null,null,null,null,null,0,0,0,0,5000,0,0,0,5000,0]
[null,"403.13186.1","DRY BOX","No","D2","D2.9",0,"",null,"Pognana Lario","NO","Progetto preliminare",2018,"-","-","-","-","100% giudizi Conformi / Regolamentari","-","-",null,null,null,null,null,null,null,null,0,0,0,0,8000,0,0,0,8000,0]
[null,"406.13186.1","Telecontrollo","Sì","K3","K3.1",0,"",null,"Pognana Lario","N.A.","Progetto preliminare",2018,"-","-","-","-","-","-","-",null,null,null,null,null,null,null,null,0,0,0,0,15000,0,0,0,15000,0]
[null,"110.13187.1","Ponna_RETE DI DISTRIBUZIONE - manutenzione straordinaria / rifacimenti (LOTTO 1)","Sì","B4","B4.1",10044,"",null,"Ponna","NO","",2018,"-","-","-","-","-","-","-",null,null,null,null,null,null,null,null,0,0,0,0,20000,0,0,0,20000,0]
[null,"202.13188.1","Ponte Lambro_RETI FOGNARIE - manutenzione straordinaria (LOTTO 1)","No","C2","C2.1",0,"",null,"Ponte Lambro","NO","",2018,"-","-","-","-","-","-","-",null,null,null,null,null,null,null,null,0,0,0,0,15910.38,0,0,0,15910.38,0]
[null,"205.13188.1","Ponte Lambro_SCARICATORI DI PIENA - manutenzione straordinaria (LOTTO 1)","No","C4","C4.2",216510,"",null,"Ponte Lambro","NO","",2018,"-","-","-","-","1 episodio/anno per scolmatore","-","-",null,null,null,null,null,null,null,null,0,0,0,0,9812.5,0,0,0,9812.5,0]
[null,"206.13188.1","Albavilla_SCARICATORI DI PIENA - nuove opere (inserimento / adeguamento paratoie) (LOTTO 1)","No","C4","C4.2",11407,"",null,"Ponte Lambro","NO","",2018,"-","-","-","-","1 episodio/anno per scolmatore","-","-",null,null,null,null,null,null,null,null,0,0,0,0,3167.5,0,0,0,3167.5,0]
[null,"102.13189.1","Ristrutturazione e potenziamento captazione sorgente \"Costa delle Baite\" ai fini idropotabili ed elettrici - 1° lotto","Sì","A1","A1.1",0,"",null,"Porlezza","NO","Studio di fattibilità",2018,"-","-","-","-",0,"-","-",null,null,null,null,null,null,null,null,0,0,0,0,785000,0,0,0,785000,0]
[null,"110.13189.1","Adeguamento e potenziamento delle rete idrica in frazione Agria","Sì","B4","B4.1",10044,"",null,"Porlezza","NO","Studio di fattibilità",2018,"-","-","-","-","-","-","-",null,null,null,null,null,null,null,null,0,0,0,0,78500,0,0,0,78500,0]
[null,"403.13189.3","By-pass interno impianto di depurazione - sostituzione mixer vasca denitrificazione - pulizia vasche","No","D2","D2.9",0,"",null,"Porlezza","NO","Progetto preliminare",2018,"-","-","-","-","100% giudizi Conformi / Regolamentari","-","-",null,null,null,null,null,null,null,null,0,0,0,0,30000,0,0,0,30000,0]
[null,"407.13189.1","adeguamento filtrazione finale","No","D1","D1.4",0,"",null,"Porlezza","NO","Progetto preliminare",2018,"-","-","-","-",0,"-","-",null,null,null,null,null,null,null,null,0,0,0,0,150000,0,0,0,150000,0]
[null,"110.13194.1","Rifacimento tubazione di adduzione idrica sorgente varesello/bacino di Verna","No","B4","B4.1",10044,"",null,"Ramponio Verna","NO","Progetto preliminare",2018,"-","-","-","-","-","-","-",null,null,null,null,null,null,null,null,0,0,0,0,47100,0,0,0,47100,0]
[null,"202.13194.1","Ramponio Verna_RETI FOGNARIE - manutenzione straordinaria (LOTTO 1) - AGGLOMERATO 2","No","C2","C2.1",0,"",null,"Ramponio Verna","NO","",2018,"-","-","-","-","-","-","-",null,null,null,null,null,null,null,null,0,0,0,0,930.77,0,0,0,930.77,0]
[null,"403.13199.2","Fitodepurazione impianto di Ronago 1° lotto","No","D2","D2.9",0,"",null,"RONAGO","NO","Studio di fattibilità",2018,"-","-","-","-","100% giudizi Conformi / Regolamentari","-","-",null,null,null,null,null,null,null,null,0,0,0,0,595000,0,0,0,595000,0]
[null,"205.13201.2","Scolmatore 4/C1 - Adeguamento opera civile esistente","Sì","C4","C4.2",216510,"",null,"Rovellasca","NO","",2018,"-","-","-","-","1 episodio/anno per scolmatore","-","-",null,null,null,null,null,null,null,null,0,0,0,0,6000,0,0,0,6000,0]
[null,"205.13202.1","Scolmatore 4/C1 - Videoispezione e chiusura manufatto di scarico ed esclusione allacciamenti meteorici","No","C4","C4.2",216510,"",null,"Rovello Porro","NO","Studio di fattibilità",2018,"-","-","-","-","1 episodio/anno per scolmatore","-","-",null,null,null,null,null,null,null,null,0,0,0,0,37200,0,0,0,37200,0]
[null,"110.13204.1","San Bartolomeo Val Cavargna_RETE DI DISTRIBUZIONE - manutenzione straordinaria / rifacimenti (LOTTO 1)","No","B4","B4.1",10044,"",null,"San Bartolomeo Val Cavargna","NO","",2018,"-","-","-","-","-","-","-",null,null,null,null,null,null,null,null,0,0,0,0,25953.59,0,0,0,25953.59,0]
[null,"403.13204.1","S. Bartolomeo Val Cavargna - Sora_DEPURATORE ESISTENTE - manutenzione straordinaria complessiva (LOTTO 1)","No","D2","D2.9",0,"",null,"San Bartolomeo Val Cavargna","NO","",2018,"-","-","-","-","100% giudizi Conformi / Regolamentari","-","-",null,null,null,null,null,null,null,null,0,0,0,0,2888.8,0,0,0,2888.8,0]
[null,"403.13204.1","S. Bartolomeo Val Cavargna - Valle di Cavada_DEPURATORE ESISTENTE - manutenzione straordinaria complessiva (LOTTO 1)","No","D2","D2.9",0,"",null,"San Bartolomeo Val Cavargna","NO","",2018,"-","-","-","-","100% giudizi Conformi / Regolamentari","-","-",null,null,null,null,null,null,null,null,0,0,0,0,11304,0,0,0,11304,0]
[null,"403.13204.1","S. Bartolomeo Val Cavargna - Valle del Vaghino_DEPURATORE ESISTENTE - manutenzione straordinaria complessiva (LOTTO 1)","No","D2","D2.9",0,"",null,"San Bartolomeo Val Cavargna","NO","",2018,"-","-","-","-","100% giudizi Conformi / Regolamentari","-","-",null,null,null,null,null,null,null,null,0,0,0,0,9997.76,0,0,0,9997.76,0]
[null,"204.13205.1","Nuovo intervento per realizzazione tratto fognatura acque chiare e nere in via vecchia per Castiglione e in via Provinciale","No","C4","C4.1",0,"",null,"San Fedele Intelvi","NO","",2018,"-","-","-","-","massimo 1 episodio ogni 2 km di rete fognaria presenti nel Comune","-","-",null,null,null,null,null,null,null,null,0,0,0,0,325000,0,0,0,325000,0]
[null,"110.13206.1","SOSTITUZIONE TUBAZIONE ESISTENTE VIA IMBONATI FONDO CIECO","Sì","B4","B4.1",10044,"",null,"San Fermo della Battaglia","NO","",2018,"-","-","-","-","-","-","-",null,null,null,null,null,null,null,null,0,0,0,0,7850,0,0,0,7850,0]
[null,"202.13206.1","San Fermo della Battaglia_RETI FOGNARIE - manutenzione straordinaria (LOTTO 1)","No","C2","C2.1",0,"",null,"San Fermo della Battaglia","NO","",2018,"-","-","-","-","-","-","-",null,null,null,null,null,null,null,null,0,0,0,0,19869.14,0,0,0,19869.14,0]
[null,"204.13206.1","San Fermo della Battaglia_RETI FOGNARIE - Separazione reti miste - nuove opere (LOTTO 1)","No","C4","C4.1",0,"",null,"San Fermo della Battaglia","NO","",2018,"-","-","-","-","massimo 1 episodio ogni 2 km di rete fognaria presenti nel Comune","-","-",null,null,null,null,null,null,null,null,0,0,0,0,22906.46,0,0,0,22906.46,0]
[null,"403.13207.2","S. Nazzaro Val Cavargna - Bruga_DEPURATORE ESISTENTE - manutenzione straordinaria complessiva (LOTTO 1)","No","D2","D2.9",0,"",null,"San Nazzaro Val Cavargna","NO","",2018,"-","-","-","-","100% giudizi Conformi / Regolamentari","-","-",null,null,null,null,null,null,null,null,0,0,0,0,10048,0,0,0,10048,0]
[null,"403.13207.3","S. Nazzaro Val Cavargna - Ponte di Lana_DEPURATORE ESISTENTE - manutenzione straordinaria complessiva (LOTTO 1)","No","D2","D2.9",0,"",null,"San Nazzaro Val Cavargna","NO","",2018,"-","-","-","-","100% giudizi Conformi / Regolamentari","-","-",null,null,null,null,null,null,null,null,0,0,0,0,3768,0,0,0,3768,0]
[null,"110.13248.1","POTENZIAMENTO ACQUEDOTTO TRECCIONE - SAN MARTINO","No","B4","B4.1",10044,"",null,"San Siro","NO","Studio di fattibilità",2018,"-","-","-","-","-","-","-",null,null,null,null,null,null,null,null,0,0,0,0,80000,0,0,0,80000,0]
[null,"403.13248.1","San Siro - Carcente_DEPURATORE ESISTENTE - manutenzione straordinaria complessiva (LOTTO 1)","No","D2","D2.9",0,"",null,"San Siro","NO","",2018,"-","-","-","-","100% giudizi Conformi / Regolamentari","-","-",null,null,null,null,null,null,null,null,0,0,0,0,5024,0,0,0,5024,0]
[null,"111.13211.1","Opere di protezione e messa in sicurezza dei serbatoi acquedotto esistente.","No","B8","B8.1",0,"",null,"Schignano","NO","Studio di fattibilità",2018,"-","-","-","-","-","-","-",null,null,null,null,null,null,null,null,0,0,0,0,45250,0,0,0,45250,0]
[null,"202.13212.1","Rifacimento fognature zona Navedano","No","C2","C2.1",0,"",null,"Senna Comasco","NO","Studio di fattibilità",2018,"-","-","-","-","-","-","-",null,null,null,null,null,null,null,null,0,0,0,0,250000,0,0,0,250000,0]
[null,"102.13215.2","PREDISPOSIZIONE CANALE DI COLLEGAMENTO TRA POZZO BINAGO IN CASO DI ALLAGAMENTO DOVUTI A FORTE PIOGGIA","No","A1","A1.1",0,"",null,"Solbiate","NO","",2018,"-","-","-","-",0,"-","-",null,null,null,null,null,null,null,null,0,0,0,0,6000,0,0,0,6000,0]
[null,"102.13215.3","RIFACIMENTO SOLETTA POZZO BINAGO ","No","A1","A1.1",0,"",null,"Solbiate","NO","",2018,"-","-","-","-",0,"-","-",null,null,null,null,null,null,null,null,0,0,0,0,5000,0,0,0,5000,0]
[null,"110.13215.1","Adeguamento collegamento nuovo pozzo con serbatoi in località Concagno","Sì","B4","B4.1",10044,"",null,"solbiate","NO","Studio di fattibilità",2018,"-","-","-","-","-","-","-",null,null,null,null,null,null,null,null,0,0,0,0,15700,0,0,0,15700,0]
[null,"204.13215.1","Solbiate_RETI FOGNARIE - Separazione reti miste - nuove opere (LOTTO 1) - Agglomerato 1","No","C4","C4.1",0,"",null,"Solbiate","NO","",2018,"-","-","-","-","massimo 1 episodio ogni 2 km di rete fognaria presenti nel Comune","-","-",null,null,null,null,null,null,null,null,0,0,0,0,5991.02,0,0,0,5991.02,0]
[null,"403.13216.1","Sorico_DEPURATORE ESISTENTE - manutenzione straordinaria complessiva (LOTTO 1)","No","D2","D2.9",0,"",null,"Sorico","NO","",2018,"-","-","-","-","100% giudizi Conformi / Regolamentari","-","-",null,null,null,null,null,null,null,null,0,0,0,0,9066.75,0,0,0,9066.75,0]
[null,"403.13216.1","Sorico - Albonico_DEPURATORE ESISTENTE - manutenzione straordinaria complessiva (LOTTO 1)","No","D2","D2.9",0,"",null,"Sorico","NO","",2018,"-","-","-","-","100% giudizi Conformi / Regolamentari","-","-",null,null,null,null,null,null,null,null,0,0,0,0,2009.6,0,0,0,2009.6,0]
[null,"202.13216.2","TRATTO LOCALITA' MADONNINA","No","C2","C2.1",0,"",null,"SORICO","NO","",2018,"-","-","-","-","-","-","-",null,null,null,null,null,null,null,null,0,0,0,0,10000,0,0,0,10000,0]
[null,"202.13216.3","ADEGUAMENTO RETE DASCIO","No","C2","C2.1",0,"",null,"SORICO","NO","",2018,"-","-","-","-","-","-","-",null,null,null,null,null,null,null,null,0,0,0,0,50000,0,0,0,50000,0]
[null,"110.13217.1","Sormano_RETE DI DISTRIBUZIONE - manutenzione straordinaria / rifacimenti (LOTTO 1)","No","B4","B4.1",10044,"",null,"Sormano","NO","",2018,"-","-","-","-","-","-","-",null,null,null,null,null,null,null,null,0,0,0,0,4452.13,0,0,0,4452.13,0]
[null,"110.13222.1","rete idrica Carlascio","No","B4","B4.1",10044,"",null,"Tavernerio","NO","Progetto preliminare",2018,"-","-","-","-","-","-","-",null,null,null,null,null,null,null,null,0,0,0,0,23550,0,0,0,23550,0]
[null,"202.13222.1","COLLETTORE FOGNARIO ROVASCIO","Sì","C2","C2.1",0,"",null,"Tavernerio","NO","Studio di fattibilità",2018,"-","-","-","-","-","-","-",null,null,null,null,null,null,null,null,0,0,0,0,40000,0,0,0,40000,0]
[null,"202.13252.2","Rifacimento rete fognaria in Via Mazzini - Località Tremezzo","Sì","C2","C2.1",0,"",null,"Tremezzina","NO","Progetto preliminare",2018,"-","-","-","-","-","-","-",null,null,null,null,null,null,null,null,0,0,0,0,75000,0,0,0,75000,0]
[null,"207.13252.1","Rifacimento completo della carpenteria (Calate, piedi accoppiamento pome, tubazioni di mandate in vasca e collettori) (LOTTO 1)","No","C2","C2.3",4659,"",null,"Tremezzina","NO","",2018,"-","-","-","-","-","-","-",null,null,null,null,null,null,null,null,0,0,0,0,27272.73,0,0,0,27272.73,0]
[null,"110.13226.1","Trezzone_RETE DI DISTRIBUZIONE - manutenzione straordinaria / rifacimenti (LOTTO 1)","No","B4","B4.1",10044,"",null,"Trezzone","NO","",2018,"-","-","-","-","-","-","-",null,null,null,null,null,null,null,null,0,0,0,0,5624.45,0,0,0,5624.45,0]
[null,"100.13227.1","Allacciamenti alla rete acquedottistica","No","-","-",0,"",null,"Turate","NO","",2018,"-","-","-","-","-","-","-",null,null,null,null,null,null,null,null,0,0,0,0,0,142400,0,0,0,142400]
[null,"200.13227.1","Allacciamenti alla rete fognaria","No","-","-",0,"",null,"Turate","NO","",2018,"-","-","-","-","-","-","-",null,null,null,null,null,null,null,null,0,0,0,0,0,210040,0,0,0,210040]
[null,"201.13227.1","Riqualificazione urbana e tecnologica via Varese","Sì","C1","C1.1",0,"",null,"Turate","NO","Progetto preliminare",2018,"-","-","-","-","-","-","-",null,null,null,null,null,null,null,null,0,0,0,0,995000,0,0,0,995000,0]
[null,"302.13228.2","Rifacimento collettore sovracomunale \"Faloppia\" - 3° lotto","Sì","C2","C2.1",0,"",null,"Uggiate Trevano","NO","Progetto preliminare",2018,"-","-","-","-","-","-","-",null,null,null,null,null,null,null,null,0,0,0,0,510250,0,0,0,510250,0]
[null,"205.13228.1","Uggiate Trevano_SCARICATORI DI PIENA - manutenzione straordinaria (LOTTO 1)","No","C4","C4.2",216510,"",null,"Uggiate Trevano","NO","",2018,"-","-","-","-","1 episodio/anno per scolmatore","-","-",null,null,null,null,null,null,null,null,0,0,0,0,21587.5,0,0,0,21587.5,0]
[null,"100.13233.1","Allacciamenti alla rete acquedottistica","No","-","-",0,"",null,"Val Rezzo","NO","",2018,"-","-","-","-","-","-","-",null,null,null,null,null,null,null,null,0,0,0,0,0,17600,0,0,0,17600]
[null,"110.13233.1","Val Rezzo_RETE DI DISTRIBUZIONE - manutenzione straordinaria / rifacimenti (LOTTO 1)","No","B4","B4.1",10044,"",null,"Val Rezzo","NO","",2018,"-","-","-","-","-","-","-",null,null,null,null,null,null,null,null,0,0,0,0,3180.9,0,0,0,3180.9,0]
[null,"200.13233.1","Allacciamenti alla rete fognaria - Agglomerato 1","No","-","-",0,"",null,"Val Rezzo","NO","",2018,"-","-","-","-","-","-","-",null,null,null,null,null,null,null,null,0,0,0,0,0,17393.2,0,0,0,17393.2]
[null,"200.13233.2","Allacciamenti alla rete fognaria - Agglomerato 2","No","-","-",0,"",null,"Val Rezzo","NO","",2018,"-","-","-","-","-","-","-",null,null,null,null,null,null,null,null,0,0,0,0,0,8566.7999999999993,0,0,0,8566.7999999999993]
[null,"201.13233.1","Adeguamento e potenziamento del sistema fognario frazione Buggiolo e Seghebbia e sistema depurativo delle acque - Agglomerato 1","Sì","C1","C1.1",0,"",null,"Val Rezzo","NO","",2018,"-","-","-","-","-","-","-",null,null,null,null,null,null,null,null,0,0,0,0,350000,0,0,0,350000,0]
[null,"201.13233.2","Adeguamento e potenziamento del sistema fognario frazione Buggiolo e Seghebbia e sistema depurativo delle acque - Agglomerato 2","Sì","C1","C1.1",0,"",null,"Val Rezzo","NO","",2018,"-","-","-","-","-","-","-",null,null,null,null,null,null,null,null,0,0,0,0,150000,0,0,0,150000,0]
[null,"100.13229.1","Allacciamenti alla rete acquedottistica","No","-","-",0,"",null,"Valbrona","NO","",2018,"-","-","-","-","-","-","-",null,null,null,null,null,null,null,null,0,0,0,0,0,136000,0,0,0,136000]
[null,"110.13229.1","Valbrona_manutenzione straordinaria reti_via Fornaci","Sì","B4","B4.1",10044,"",null,"Valbrona","NO","Studio di fattibilità",2018,"-","-","-","-","-","-","-",null,null,null,null,null,null,null,null,0,0,0,0,6000,0,0,0,6000,0]
[null,"110.13229.2","Valbrona_manutenzione straordinaria reti_via Pozzo di Rossana","Sì","B4","B4.1",10044,"",null,"Valbrona","NO","Studio di fattibilità",2018,"-","-","-","-","-","-","-",null,null,null,null,null,null,null,null,0,0,0,0,2500,0,0,0,2500,0]
[null,"110.13229.3","Valbrona_manutenzione straordinaria reti_via Don Orsenigo e via Porta","No","B4","B4.1",10044,"",null,"Valbrona","NO","Studio di fattibilità",2018,"-","-","-","-","-","-","-",null,null,null,null,null,null,null,null,0,0,0,0,100000,0,0,0,100000,0]
[null,"110.13229.4","Valbrona_manutenzione straordinaria reti_via Ziniga","Sì","B4","B4.1",10044,"",null,"Valbrona","NO","Studio di fattibilità",2018,"-","-","-","-","-","-","-",null,null,null,null,null,null,null,null,0,0,0,0,30000,0,0,0,30000,0]
[null,"200.13229.1","Allacciamenti alla rete fognaria","No","-","-",0,"",null,"Valbrona","NO","",2018,"-","-","-","-","-","-","-",null,null,null,null,null,null,null,null,0,0,0,0,0,200600,0,0,{"$f":"SUM(AC1147+AE1147+AG1147+AI1147)","v":0},{"$f":"SUM(AD1147+AF1147+AH1147+AJ1147)","v":200600}]
[null,"201.13229.4","Progetto delle reti fognarie mancanti nei tratti all'interno del perimetro dell'agglomerato","Sì","C1","C1.1",0,112,"rilevata","Valbrona","NO","Studio di fattibilità",2018,"-","-","-","-","-","-","-",null,null,null,null,null,null,null,null,0,0,0,0,969000,0,0,0,969000,0]
[null,"204.13229.1","Valbrona_RETI FOGNARIE - Separazione reti miste - nuove opere (LOTTO 1)","No","C4","C4.1",0,"",null,"Valbrona","NO","",2018,"-","-","-","-","massimo 1 episodio ogni 2 km di rete fognaria presenti nel Comune","-","-",null,null,null,null,null,null,null,null,0,0,0,0,14530.68,0,0,0,14530.68,0]
[null,"205.13229.1","Valbrona_SCARICATORI DI PIENA - manutenzione straordinaria (LOTTO 1)","No","C4","C4.2",216510,"",null,"Valbrona","NO","",2018,"-","-","-","-","1 episodio/anno per scolmatore","-","-",null,null,null,null,null,null,null,null,0,0,0,0,11775,0,0,0,11775,0]
[null,"206.13229.1","Valbrona_SCARICATORI DI PIENA - nuove opere (inserimento / adeguamento paratoie) (LOTTO 1)","No","C4","C4.2",11407,"",null,"Valbrona","NO","",2018,"-","-","-","-","1 episodio/anno per scolmatore","-","-",null,null,null,null,null,null,null,null,0,0,0,0,3801,0,0,0,3801,0]
[null,"110.13232.1","Valmorea_RETE DI DISTRIBUZIONE - manutenzione straordinaria / rifacimenti (LOTTO 1)","No","B4","B4.1",10044,"",null,"Valmorea","NO","",2018,"-","-","-","-","-","-","-",null,null,null,null,null,null,null,null,0,0,0,0,3378.25,0,0,0,3378.25,0]
[null,"204.13232.1","Valmorea_RETI FOGNARIE - Separazione reti miste - nuove opere (LOTTO 1)","No","C4","C4.1",0,"",null,"Valmorea","NO","",2018,"-","-","-","-","massimo 1 episodio ogni 2 km di rete fognaria presenti nel Comune","-","-",null,null,null,null,null,null,null,null,0,0,0,0,14756.03,0,0,0,14756.03,0]
[null,"110.13234.2","Valsolda_RETE DI DISTRIBUZIONE - manutenzione straordinaria / rifacimenti (LOTTO 1)","No","B4","B4.1",10044,"",null,"Valsolda","NO","",2018,"-","-","-","-","-","-","-",null,null,null,null,null,null,null,null,0,0,0,0,24173.599999999999,0,0,0,24173.599999999999,0]
[null,"403.13234.1","Rifacimento carpenteria a servizio della vasca di ossidazione e dell'ispessitore","No","D2","D2.9",0,"",null,"Valsolda","NO","Progetto preliminare",2018,"-","-","-","-","100% giudizi Conformi / Regolamentari","-","-",null,null,null,null,null,null,null,null,0,0,0,0,30000,0,0,0,30000,0]
[null,"403.13234.1","Posizionamento nuova griglia ingresso impianto","No","D2","D2.9",0,"",null,"Valsolda","NO","Progetto preliminare",2018,"-","-","-","-","100% giudizi Conformi / Regolamentari","-","-",null,null,null,null,null,null,null,null,0,0,0,0,50000,0,0,0,50000,0]
[null,"403.13234.2","posizionamento nuovo SAP","No","D2","D2.9",0,"",null,"Valsolda","NO","Progetto preliminare",2018,"-","-","-","-","100% giudizi Conformi / Regolamentari","-","-",null,null,null,null,null,null,null,null,0,0,0,0,10000,0,0,0,10000,0]
[null,"100.13236.1","Allacciamenti alla rete acquedottistica","No","-","-",0,"",null,"Veleso","NO","",2018,"-","-","-","-","-","-","-",null,null,null,null,null,null,null,null,0,0,0,0,0,25600,0,0,0,25600]
[null,"110.13236.1","Veleso_RETE DI DISTRIBUZIONE - manutenzione straordinaria / rifacimenti (LOTTO 1)","No","B4","B4.1",10044,"",null,"Veleso","NO","",2018,"-","-","-","-","-","-","-",null,null,null,null,null,null,null,null,0,0,0,0,6699.82,0,0,0,6699.82,0]
[null,"403.13236.1","posizionamento griglia pulizia automatica","No","D2","D2.9",0,"",null,"Veleso","NO","Progetto preliminare",2018,"-","-","-","-","100% giudizi Conformi / Regolamentari","-","-",null,null,null,null,null,null,null,null,0,0,0,0,40000,0,0,0,40000,0]
[null,"200.13236.1","Allacciamenti alla rete fognaria","No","-","-",0,"",null,"Veleso","NO","",2018,"-","-","-","-","-","-","-",null,null,null,null,null,null,null,null,0,0,0,0,0,37760,0,0,0,37760]
[null,"201.13236.1","Veleso_RETI FOGNARIE - Estensione - nuove opere","Sì","C1","C1.1",0,"",null,"Veleso","NO","",2018,"-","-","-","-","-","-","-",null,null,null,null,null,null,null,null,0,0,0,0,169316.63,0,0,0,169316.63,0]
[null,"111.13238.1","Adeguamento serbatoi","No","B8","B8.1",0,"",null,"Veniano","NO","Studio di fattibilità",2018,"-","-","-","-","-","-","-",null,null,null,null,null,null,null,null,0,0,0,0,58825,0,0,0,58825,0]
[null,"204.13238.1","Veniano_RETI FOGNARIE - Separazione reti miste - nuove opere (LOTTO 1)","No","C4","C4.1",0,"",null,"Veniano","NO","",2018,"-","-","-","-","massimo 1 episodio ogni 2 km di rete fognaria presenti nel Comune","-","-",null,null,null,null,null,null,null,null,0,0,0,0,17963.8,0,0,0,17963.8,0]
[null,"202.13242.1","Eliminazione acque improprie nelle fognature nere","Sì","C2","C2.1",0,"",null,"Vertemate con Minoprio","NO","Studio di fattibilità",2018,"-","-","-","-","-","-","-",null,null,null,null,null,null,null,null,0,0,0,0,100000,0,0,0,100000,0]
[null,"205.13242.1","Vertemate con Minoprio_SCARICATORI DI PIENA - manutenzione straordinaria (LOTTO 1)","No","C4","C4.2",216510,"",null,"Vertemate con Minoprio","NO","",2018,"-","-","-","-","1 episodio/anno per scolmatore","-","-",null,null,null,null,null,null,null,null,0,0,0,0,11775,0,0,0,11775,0]
[null,"206.13242.1","Vertemate con Minoprio_SCARICATORI DI PIENA - nuove opere (inserimento / adeguamento paratoie) (LOTTO 1)","No","C4","C4.2",11407,"",null,"Vertemate con Minoprio","NO","",2018,"-","-","-","-","1 episodio/anno per scolmatore","-","-",null,null,null,null,null,null,null,null,0,0,0,0,3801,0,0,0,3801,0]
[null,"100.13246.1","Allacciamenti alla rete acquedottistica","No","-","-",0,"",null,"Zelbio","NO","",2018,"-","-","-","-","-","-","-",null,null,null,null,null,null,null,null,0,0,0,0,0,14400,0,0,0,14400]
[null,"200.13246.1","Allacciamenti alla rete fognaria","No","-","-",0,"",null,"Zelbio","NO","",2018,"-","-","-","-","-","-","-",null,null,null,null,null,null,null,null,0,0,0,0,0,21240,0,0,0,21240]
[null,"201.13246.1","posa di fognatura separata via pian del Tivano - Piazza Roma","No","C1","C1.1",0,22,"rilevata","Zelbio","NO","",2018,"-","-","-","-","-","-","-",null,null,null,null,null,null,null,null,0,0,0,0,88529,0,0,0,88529,0]
[null,"102.13003.1","MESSA A NORMA ED IN SICUREZZA STAZIONE DI SOLLEVAMENTO ALBAVILLA-CARCANO (in comune di Alserio)","No","A1","A1.1",0,"",null,"Albavilla","NO","Studio di fattibilità",2019,"-","-","-","-","-",0,"-",null,null,null,null,null,null,null,null,0,0,0,0,0,0,41152.26,0,41152.26,0]
[null,"202.13003.1","Albavilla_RETI FOGNARIE - manutenzione straordinaria (LOTTO 1) - AGGLOMERATO 1","No","C2","C2.1",0,"",null,"Albavilla","NO","",2019,"-","-","-","-","-","-","-",null,null,null,null,null,null,null,null,0,0,0,0,0,0,11237.07,0,11237.07,0]
[null,"204.13003.2","SEPARAZIONE RETI DEL BACINO FOGNARIO DELLA VALLE DI CARCANO - lotto 1","No","C4","C4.1",0,"",null,"Albavilla","NO","Progetto preliminare",2019,"-","-","-","-","-","massimo 1 episodio ogni 2 km di rete fognaria presenti nel Comune","-",null,null,null,null,null,null,null,null,0,0,0,0,0,0,625514.4,0,625514.4,0]
[null,"205.13003.1","Albavilla_SCARICATORI DI PIENA - manutenzione straordinaria (LOTTO 1) - Agglomerato 1","No","C4","C4.2",216510,"",null,"Albavilla","NO","",2019,"-","-","-","-","-","1 episodio/anno per scolmatore","-",null,null,null,null,null,null,null,null,0,0,0,0,0,0,1962.5,0,1962.5,0]
[null,"205.13003.2","Albavilla_SCARICATORI DI PIENA - manutenzione straordinaria (LOTTO 1) - Agglomerato 2","No","C4","C4.2",216510,"",null,"Albavilla","NO","",2019,"-","-","-","-","-","1 episodio/anno per scolmatore","-",null,null,null,null,null,null,null,null,0,0,0,0,0,0,15700,0,15700,0]
[null,"206.13003.1","Albavilla_SCARICATORI DI PIENA - nuove opere (inserimento / adeguamento paratoie) (LOTTO 1) - Agglomerato 1","No","C4","C4.2",11407,"",null,"Albavilla","NO","",2019,"-","-","-","-","-","1 episodio/anno per scolmatore","-",null,null,null,null,null,null,null,null,0,0,0,0,0,0,633.5,0,633.5,0]
[null,"206.13003.2","Albavilla_SCARICATORI DI PIENA - nuove opere (inserimento / adeguamento paratoie) (LOTTO 1) - Agglomerato 2","No","C4","C4.2",11407,"",null,"Albavilla","NO","",2019,"-","-","-","-","-","1 episodio/anno per scolmatore","-",null,null,null,null,null,null,null,null,0,0,0,0,0,0,5068,0,5068,0]
[null,"205.13004.1","Adeguamento scolmatori consortili (LOTTO 1)","No","C4","C4.2",216510,"",null,"Albese con Cassano","NO","",2019,"-","-","-","-","-","1 episodio/anno per scolmatore","-",null,null,null,null,null,null,null,null,0,0,0,0,0,0,60000,0,60000,0]
[null,"202.13004.1","Nuovo collettore di fognatura \"mista\" (collegamento fino alla Via V. Veneto) e completamento della rete acque reflue in Via Colombo.","Sì","C2","C2.1",0,"",null,"Albese con Cassano","NO","Progetto preliminare",2019,"-","-","-","-","-","-","-",null,null,null,null,null,null,null,null,0,0,0,0,0,0,125000,0,125000,0]
[null,"204.13004.1","separazione rete mista in via Roncaldier","No","C4","C4.1",0,"",null,"Albese con Cassano","NO","Progetto preliminare",2019,"-","-","-","-","-","massimo 1 episodio ogni 2 km di rete fognaria presenti nel Comune","-",null,null,null,null,null,null,null,null,0,0,0,0,0,0,30000,0,30000,0]
[null,"204.13004.2","Albese con Cassano_RETI FOGNARIE - Separazione reti miste - nuove opere (LOTTO 1)","No","C4","C4.1",0,"",null,"Albese con Cassano","NO","",2019,"-","-","-","-","-","massimo 1 episodio ogni 2 km di rete fognaria presenti nel Comune","-",null,null,null,null,null,null,null,null,0,0,0,0,0,0,31495.4,0,31495.4,0]
[null,"110.13006.1","Alserio_RETE DI DISTRIBUZIONE - manutenzione straordinaria / rifacimenti (LOTTO 1)","No","B4","B4.1",10044,"",null,"Alserio","NO","",2019,"-","-","-","-","-","-","-",null,null,null,null,null,null,null,null,0,0,0,0,0,0,2541.67,0,2541.67,0]
[null,"204.13006.1","Alserio_RETI FOGNARIE - Separazione reti miste - nuove opere (LOTTO 1)","No","C4","C4.1",0,"",null,"Alserio","NO","",2019,"-","-","-","-","-","massimo 1 episodio ogni 2 km di rete fognaria presenti nel Comune","-",null,null,null,null,null,null,null,null,0,0,0,0,0,0,8108.35,0,8108.35,0]
[null,"205.13007.2","Adeguamento scolmatori consortili (LOTTO 2)","No","C4","C4.2",216510,"",null,"Alzate Brianza","NO","",2019,"-","-","-","-","-","1 episodio/anno per scolmatore","-",null,null,null,null,null,null,null,null,0,0,0,0,0,0,60000,0,60000,0]
[null,"202.13007.3","Alzate Brianza_RETI FOGNARIE - manutenzione straordinaria (LOTTO 1) - AGGLOMERATO 1","No","C2","C2.1",0,"",null,"Alzate Brianza","NO","",2019,"-","-","-","-","-","-","-",null,null,null,null,null,null,null,null,0,0,0,0,0,0,7311.67,0,7311.67,0]
[null,"206.13007.1","Alzate Brianza_SCARICATORI DI PIENA - nuove opere (inserimento / adeguamento paratoie) (LOTTO 1) - AGGLOMERATO 1","No","C4","C4.2",11407,"",null,"Alzate Brianza","NO","",2019,"-","-","-","-","-","1 episodio/anno per scolmatore","-",null,null,null,null,null,null,null,null,0,0,0,0,0,0,3167.5,0,3167.5,0]
[null,"206.13007.1","Alzate Brianza_SCARICATORI DI PIENA - nuove opere (inserimento / adeguamento paratoie) (LOTTO 1) - AGGLOMERATO 2","No","C4","C4.2",11407,"",null,"Alzate Brianza","NO","",2019,"-","-","-","-","-","1 episodio/anno per scolmatore","-",null,null,null,null,null,null,null,null,0,0,0,0,0,0,1900.5,0,1900.5,0]
[null,"101.13009.1","realizzazione recinzione pozzo","No","A1","A1.4",633,"",null,"Anzano del Parco","NO","",2019,"-","-","-","-","-","-","-",null,null,null,null,null,null,null,null,0,0,0,0,0,0,5000,0,5000,0]
[null,"204.13009.1","separazione rete attualmente mista","No","C4","C4.1",0,"",null,"Anzano del Parco","NO","",2019,"-","-","-","-","-","massimo 1 episodio ogni 2 km di rete fognaria presenti nel Comune","-",null,null,null,null,null,null,null,null,0,0,0,0,0,0,100000,0,100000,0]
[null,"204.13010.1","Appiano Gentile_RETI FOGNARIE - Separazione reti miste - nuove opere (LOTTO 1) - Agglomerato 1","No","C4","C4.1",0,"",null,"Appiano Gentile","NO","",2019,"-","-","-","-","-","massimo 1 episodio ogni 2 km di rete fognaria presenti nel Comune","-",null,null,null,null,null,null,null,null,0,0,0,0,0,0,39602.35,0,39602.35,0]
[null,"207.13010.1","Appiano Gentile_STAZIONI DI SOLLEVAMENTO - manutenzione straordinaria (prioritario con attivazione immediata) - AGGLOMERATO 1","No","C2","C2.3",4659,"",null,"Appiano Gentile","NO","",2019,"-","-","-","-","-","-","-",null,null,null,null,null,null,null,null,0,0,0,0,0,0,4003.5,0,4003.5,0]
[null,"110.13011.2","Rifacimento acquedotto in via Garibaldi","Sì","B4","B4.1",10044,"",null,"ARGEGNO","NO","Studio di fattibilità",2019,"-","-","-","-","-","-","-",null,null,null,null,null,null,null,null,0,0,0,0,0,0,78500,0,78500,0]
[null,"202.13011.1","Argegno_RETI FOGNARIE - manutenzione straordinaria (LOTTO 1)","No","C2","C2.1",0,"",null,"Argegno","NO","",2019,"-","-","-","-","-","-","-",null,null,null,null,null,null,null,null,0,0,0,0,0,0,1100.73,0,1100.73,0]
[null,"204.13011.3","RETI FOGNARIE - SEPARAZIONE RETI MISTE - NUOVE OPERE - VIA CACCIATORI DELLE ALPI","No","C4","C4.1",0,"",null,"Argegno","NO","Progetto preliminare",2019,"-","-","-","-","-","massimo 1 episodio ogni 2 km di rete fognaria presenti nel Comune","-",null,null,null,null,null,null,null,null,0,0,0,0,0,0,25000,0,25000,0]
[null,"204.13012.1","Arosio_RETI FOGNARIE - Separazione reti miste - nuove opere (LOTTO 1) - AGGLOMERATO 1","No","C4","C4.1",0,"",null,"Arosio","NO","",2019,"-","-","-","-","-","massimo 1 episodio ogni 2 km di rete fognaria presenti nel Comune","-",null,null,null,null,null,null,null,null,0,0,0,0,0,0,20304.13,0,20304.13,0]
[null,"110.13013.2","Rifacimento tratto acquedotto centro storico - II Lotto da via Matteotti-via G. Merzario tratto da p.zza Mazzini a via Ponte Oscuro","Sì","B4","B4.1",10044,"",null,"Asso","NO","Progetto preliminare",2019,"-","-","-","-","-","-","-",null,null,null,null,null,null,null,null,0,0,0,0,0,0,70000,0,70000,0]
[null,"202.13013.2","Rifacimento tratto fognatura centro storico - II Lotto da via Matteotti-via G. Merzario tratto da p.zza Mazzini a via Ponte Oscuro","No","C2","C2.1",0,"",null,"Asso","NO","Progetto preliminare",2019,"-","-","-","-","-","-","-",null,null,null,null,null,null,null,null,0,0,0,0,0,0,370000,0,370000,0]
[null,"206.13013.1","Asso_SCARICATORI DI PIENA - nuove opere (inserimento / adeguamento paratoie) (LOTTO 1)","No","C4","C4.2",11407,"",null,"Asso","NO","",2019,"-","-","-","-","-","1 episodio/anno per scolmatore","-",null,null,null,null,null,null,null,null,0,0,0,0,0,0,3167.5,0,3167.5,0]
[null,"110.13015.1","Barni_RETE DI DISTRIBUZIONE - manutenzione straordinaria / rifacimenti (LOTTO 1)","No","B4","B4.1",10044,"",null,"Barni","NO","",2019,"-","-","-","-","-","-","-",null,null,null,null,null,null,null,null,0,0,0,0,0,0,4902.5600000000004,0,4902.5600000000004,0]
[null,"403.13015.1","Barni - Crezzo_DEPURATORE ESISTENTE - manutenzione straordinaria complessiva (LOTTO 1)","No","D2","D2.9",0,"",null,"Barni","NO","",2019,"-","-","-","-","-","100% giudizi Conformi / Regolamentari","-",null,null,null,null,null,null,null,null,0,0,0,0,0,0,502.4,0,502.4,0]
[null,"204.13015.1","Barni_RETI FOGNARIE - Separazione reti miste - nuove opere (LOTTO 1) - AGGLOMERATO 1","No","C4","C4.1",0,"",null,"Barni","NO","",2019,"-","-","-","-","-","massimo 1 episodio ogni 2 km di rete fognaria presenti nel Comune","-",null,null,null,null,null,null,null,null,0,0,0,0,0,0,2788.31,0,2788.31,0]
[null,"403.13019.1","Bellagio_DEPURATORE ESISTENTE - manutenzione straordinaria complessiva (LOTTO 1)","No","D2","D2.9",0,"",null,"Bellagio","NO","",2019,"-","-","-","-","-","100% giudizi Conformi / Regolamentari","-",null,null,null,null,null,null,null,null,0,0,0,0,0,0,37091.25,0,37091.25,0]
[null,"304.13019.2","LAVORI DI REALIZZAZIONE COLLETTORE FOGNARIO - LOTTO Q - DA CIVENNA 2 AL COLLETTORE ESISTENTE DIREZIONE VASSENA","No","C1","C1.1",0,"",null,"Bellagio","NO","Progetto preliminare",2019,"-","-","-","-","-","-","-",null,null,null,null,null,null,null,null,0,0,0,0,0,0,300000,0,300000,0]
[null,"201.13019.2","LAVORI DI REALIZZAZIONE COLLETTORE FOGNARIO - TRATTO M-L - LUNGO LE STRADE COMUNALI DI: Via Plinio e Via Legnone","No","C1","C1.1",0,39,"rilevata","Bellagio","NO","Studio di fattibilità",2019,"-","-","-","-","-","-","-",null,null,null,null,null,null,null,null,0,0,0,0,0,0,550000,0,550000,0]
[null,"204.13019.1","Bellagio_RETI FOGNARIE - Separazione reti miste - nuove opere (LOTTO 1) - AGGLOMERATO 1","No","C4","C4.1",0,"",null,"Bellagio","NO","",2019,"-","-","-","-","-","massimo 1 episodio ogni 2 km di rete fognaria presenti nel Comune","-",null,null,null,null,null,null,null,null,0,0,0,0,0,0,19796.900000000001,0,19796.900000000001,0]
[null,"204.13019.2","Bellagio_RETI FOGNARIE - Separazione reti miste - nuove opere (LOTTO 1) - AGGLOMERATO 2","No","C4","C4.1",0,"",null,"Bellagio","NO","",2019,"-","-","-","-","-","massimo 1 episodio ogni 2 km di rete fognaria presenti nel Comune","-",null,null,null,null,null,null,null,null,0,0,0,0,0,0,2874.97,0,2874.97,0]
[null,"204.13019.3","Bellagio_RETI FOGNARIE - Separazione reti miste - nuove opere (LOTTO 1) - AGGLOMERATO 3","No","C4","C4.1",0,"",null,"Bellagio","NO","",2019,"-","-","-","-","-","massimo 1 episodio ogni 2 km di rete fognaria presenti nel Comune","-",null,null,null,null,null,null,null,null,0,0,0,0,0,0,4141.43,0,4141.43,0]
[null,"102.13021.1","Posa di contatori sulle sorgenti comunali","No","A1","A1.1",0,"",null,"Bene Lario","NO","",2019,"-","-","-","-","-",0,"-",null,null,null,null,null,null,null,null,0,0,0,0,0,0,3925,0,3925,0]
[null,"108.13021.1","Posa rielvatori di soglia dell'accumulo nei bacini","No","K3","K3.1",0,"",null,"Bene Lario","N.A.","",2019,"-","-","-","-","-","-","-",null,null,null,null,null,null,null,null,0,0,0,0,0,0,18100,0,18100,0]
[null,"202.13021.1","Bene Lario_RETI FOGNARIE - manutenzione straordinaria (LOTTO 1)","No","C2","C2.1",0,"",null,"Bene Lario","NO","",2019,"-","-","-","-","-","-","-",null,null,null,null,null,null,null,null,0,0,0,0,0,0,1709.49,0,1709.49,0]
[null,"205.13022.2","Adeguamento scolmatore consortile 9-C1 nel Comune di Beregazzo con Figliaro con realizzazione sistema di affinamento acque di sfioro mediante fitodepurazione","No","C4","C4.2",216510,"",null,"Beregazzo con Figliaro","NO","Studio di fattibilità",2019,"-","-","-","-","-","1 episodio/anno per scolmatore","-",null,null,null,null,null,null,null,null,0,0,0,0,0,0,500000,0,{"$f":"SUM(AC1211+AE1211+AG1211+AI1211)","v":500000},{"$f":"SUM(AD1211+AF1211+AH1211+AJ1211)","v":0}]
[null,"206.13022.1","Beregazzo con Figliaro_SCARICATORI DI PIENA - nuove opere (inserimento / adeguamento paratoie) (LOTTO 1)","No","C4","C4.2",11407,"",null,"Beregazzo con Figliaro","NO","",2019,"-","-","-","-","-","1 episodio/anno per scolmatore","-",null,null,null,null,null,null,null,null,0,0,0,0,0,0,1267,0,1267,0]
[null,"202.13023.1","Binago_RETI FOGNARIE - manutenzione straordinaria (LOTTO 1)","No","C2","C2.1",0,"",null,"Binago","NO","",2019,"-","-","-","-","-","-","-",null,null,null,null,null,null,null,null,0,0,0,0,0,0,20794.650000000001,0,20794.650000000001,0]
[null,"204.13023.1","Binago_RETI FOGNARIE - Separazione reti miste - nuove opere (LOTTO 1)","No","C4","C4.1",0,"",null,"Binago","NO","",2019,"-","-","-","-","-","massimo 1 episodio ogni 2 km di rete fognaria presenti nel Comune","-",null,null,null,null,null,null,null,null,0,0,0,0,0,0,23973.45,0,23973.45,0]
[null,"205.13023.1","Binago_SCARICATORI DI PIENA - manutenzione straordinaria","No","C4","C4.2",216510,"",null,"Binago","NO","",2019,"-","-","-","-","-","1 episodio/anno per scolmatore","-",null,null,null,null,null,null,null,null,0,0,0,0,0,0,11775,0,11775,0]
[null,"110.13024.1","SOSTITUZIONE TUBAZIONE IN VIA MATTEOTTI","No","B4","B4.1",10044,"",null,"Bizzarone","NO","",2019,"-","-","-","-","-","-","-",null,null,null,null,null,null,null,null,0,0,0,0,0,0,80000,0,80000,0]
[null,"202.13024.1","RIFACIMENTO TRONCO DI FOGNATURA A MONTE DELLA STAZIONE DI SOLLEVAMENTO DI VIA TERRANERA","Sì","C2","C2.1",0,"",null,"Bizzarone","NO","Studio di fattibilità",2019,"-","-","-","-","-","-","-",null,null,null,null,null,null,null,null,0,0,0,0,0,0,100000,0,100000,0]
[null,"110.13025.1","Blessagno_RETE DI DISTRIBUZIONE - manutenzione straordinaria / rifacimenti (LOTTO 1)","No","B4","B4.1",10044,"",null,"Blessagno","NO","",2019,"-","-","-","-","-","-","-",null,null,null,null,null,null,null,null,0,0,0,0,0,0,19307.47,0,19307.47,0]
[null,"110.13026.1","Manutenzione straordinaria di alcuni tratti di tubazione in ferro con la sostituzione in polietilene","No","B4","B4.1",10044,"",null,"BLEVIO","NO","",2019,"-","-","-","-","-","-","-",null,null,null,null,null,null,null,null,0,0,0,0,0,0,235500,0,235500,0]
[null,"202.13026.1","Blevio_RETI FOGNARIE - manutenzione straordinaria (LOTTO 1)","No","C2","C2.1",0,"",null,"Blevio","NO","",2019,"-","-","-","-","-","-","-",null,null,null,null,null,null,null,null,0,0,0,0,0,0,1776.38,0,1776.38,0]
[null,"202.13028.2","Alleggerimento via Resistenza","No","C2","C2.1",0,"",null,"Bregnano","NO","Studio di fattibilità",2019,"-","-","-","-","-","-","-",null,null,null,null,null,null,null,null,0,0,0,0,0,0,354000,0,354000,0]
[null,"207.13028.1","Bregnano_STAZIONI DI SOLLEVAMENTO - manutenzione straordinaria (LOTTO 1)","No","C2","C2.3",4659,"",null,"Bregnano","NO","",2019,"-","-","-","-","-","-","-",null,null,null,null,null,null,null,null,0,0,0,0,0,0,8007,0,8007,0]
[null,"205.13029.3","Adeguamento scolmatori consortili (LOTTO 3)","No","C4","C4.2",216510,"",null,"Brenna","NO","",2019,"-","-","-","-","-","1 episodio/anno per scolmatore","-",null,null,null,null,null,null,null,null,0,0,0,0,0,0,60000,0,60000,0]
[null,"205.13029.1","Brenna_SCARICATORI DI PIENA - manutenzione straordinaria (LOTTO 1)","No","C4","C4.2",216510,"",null,"Brenna","NO","",2019,"-","-","-","-","-","1 episodio/anno per scolmatore","-",null,null,null,null,null,null,null,null,0,0,0,0,0,0,17662.5,0,17662.5,0]
[null,"207.13029.1","Brenna_STAZIONI DI SOLLEVAMENTO - manutenzione straordinaria (LOTTO 1)","No","C2","C2.3",4659,"",null,"Brenna","NO","",2019,"-","-","-","-","-","-","-",null,null,null,null,null,null,null,null,0,0,0,0,0,0,4003.5,0,4003.5,0]
[null,"305.13029.2","Vasca di accumulo acque di prima pioggia sul collettore Alzate B,za-Carugo (in Comune di Brenna) - Secondo lotto funzionale","No","C8","C8.1",210043.56,"",null,"BRENNA","NO","Studio di fattibilità",2019,"-","-","-","-","-","massimo 1 episodio ogni 2 km di rete fognaria presenti nel Comune","-",null,null,null,null,null,null,null,null,0,0,0,0,0,0,2200000,0,2200000,0]
[null,"110.13030.1","Adeguamento e potenziamento rete distributiva acquedotto comunale (LOTTO 1)","No","B4","B4.1",10044,"",null,"BRIENNO","NO","",2019,"-","-","-","-","-","-","-",null,null,null,null,null,null,null,null,0,0,0,0,0,0,78500,0,78500,0]
[null,"202.13030.1","Brienno_RETI FOGNARIE - manutenzione straordinaria (LOTTO 1)","No","C2","C2.1",0,"",null,"Brienno","NO","",2019,"-","-","-","-","-","-","-",null,null,null,null,null,null,null,null,0,0,0,0,0,0,586.63,0,586.63,0]
[null,"111.13034.1","Lavori adeguamento serbatoio, pozzi e impianto di strippaggio via Montechiaro","No","B8","B8.1",0,"",null,"Bulgarograsso","NO","Studio di fattibilità",2019,"-","-","-","-","-","-","-",null,null,null,null,null,null,null,null,0,0,0,0,0,0,181000,0,181000,0]
[null,"403.13034.4","adeguamento sezione di ozonizzazione del depuratore di Bulgarograsso","No","D2","D2.9",0,"",null,"Bulgarograsso","NO","Progetto preliminare",2019,"-","-","-","-","-","100% giudizi Conformi / Regolamentari","-",null,null,null,null,null,null,null,null,0,0,0,0,0,0,420000,0,420000,0]
[null,"407.13034.1","interventi di adeguamento impianto di depurazione di Bulgarograsso - filtrazione finale","No","D1","D1.4",0,"",null,"Bulgarograsso","NO","Progetto preliminare",2019,"-","-","-","-","-",0,"-",null,null,null,null,null,null,null,null,0,0,0,0,0,0,1320000,0,1320000,0]
[null,"204.13034.1","Bulgarograsso_RETI FOGNARIE - Separazione reti miste - nuove opere (LOTTO 1)","No","C4","C4.1",0,"",null,"Bulgarograsso","NO","",2019,"-","-","-","-","-","massimo 1 episodio ogni 2 km di rete fognaria presenti nel Comune","-",null,null,null,null,null,null,null,null,0,0,0,0,0,0,18327.61,0,18327.61,0]
[null,"110.13035.1","Cabiate_RETE DI DISTRIBUZIONE - manutenzione straordinaria / rifacimenti (LOTTO 1)","No","B4","B4.1",10044,"",null,"Cabiate","NO","",2019,"-","-","-","-","-","-","-",null,null,null,null,null,null,null,null,0,0,0,0,0,0,7354.44,0,7354.44,0]
[null,"204.13035.1","Cabiate_RETI FOGNARIE - Separazione reti miste - nuove opere (LOTTO 1)","No","C4","C4.1",0,"",null,"Cabiate","NO","",2019,"-","-","-","-","-","massimo 1 episodio ogni 2 km di rete fognaria presenti nel Comune","-",null,null,null,null,null,null,null,null,0,0,0,0,0,0,40725,0,40725,0]
[null,"205.13035.1","Cabiate_SCARICATORI DI PIENA - manutenzione straordinaria (LOTTO 1)","No","C4","C4.2",216510,"",null,"Cabiate","NO","",2019,"-","-","-","-","-","1 episodio/anno per scolmatore","-",null,null,null,null,null,null,null,null,0,0,0,0,0,0,19625,0,19625,0]
[null,"206.13035.1","Cabiate_SCARICATORI DI PIENA - nuove opere (inserimento / adeguamento paratoie) (LOTTO 1)","No","C4","C4.2",11407,"",null,"Cabiate","NO","",2019,"-","-","-","-","-","1 episodio/anno per scolmatore","-",null,null,null,null,null,null,null,null,0,0,0,0,0,0,6335,0,6335,0]
[null,"103.13036.1","collegamento rete Cadorago (Caslino al piano) e Lomazzo nord","No","A1","A1.1",549901,"",null,"Cadorago","NO","",2019,"-","-","-","-","-",0,"-",null,null,null,null,null,null,null,null,0,0,0,0,0,0,117650,0,117650,0]
[null,"110.13036.1","Cadorago_RETE DI DISTRIBUZIONE - manutenzione straordinaria / rifacimenti (LOTTO 1)","Sì","B4","B4.1",10044,"",null,"Cadorago","NO","",2019,"-","-","-","-","-","-","-",null,null,null,null,null,null,null,null,0,0,0,0,0,0,43881.5,0,43881.5,0]
[null,"110.13038.2","SOSTITUZIONE TUBAZIONE RETE PRINCIPALE CONTENENTE AMIANTO","No","B4","B4.1",10044,"",null,"CAGNO","NO","",2019,"-","-","-","-","-","-","-",null,null,null,null,null,null,null,null,0,0,0,0,0,0,39250,0,39250,0]
[null,"202.13038.1","Cagno_RETI FOGNARIE - manutenzione straordinaria (LOTTO 1)","No","C2","C2.1",0,"",null,"Cagno","NO","",2019,"-","-","-","-","-","-","-",null,null,null,null,null,null,null,null,0,0,0,0,0,0,6949.61,0,6949.61,0]
[null,"206.13038.1","Cagno_SCARICATORI DI PIENA - nuove opere (inserimento / adeguamento paratoie) (prioritario con attivazione immediata)","No","C4","C4.2",11407,"",null,"Cagno","NO","",2019,"-","-","-","-","-","1 episodio/anno per scolmatore","-",null,null,null,null,null,null,null,null,0,0,0,0,0,0,633.5,0,633.5,0]
[null,"207.13038.1","Cagno_STAZIONI DI SOLLEVAMENTO - manutenzione straordinaria","No","C2","C2.3",4659,"",null,"Cagno","NO","",2019,"-","-","-","-","-","-","-",null,null,null,null,null,null,null,null,0,0,0,0,0,0,16014,0,16014,0]
[null,"102.13041.2","SOSTITUZIONE POMPE PREMENTI C/O CENTRALE IDRICA \"ASNAGO\" - LOCALITA' CANTU' ASNAGO","No","A1","A1.1",0,"",null,"Cantù","NO","Studio di fattibilità",2019,"-","-","-","-","-",0,"-",null,null,null,null,null,null,null,null,0,0,0,0,0,0,170000,0,170000,0]
[null,"103.13041.2","INTERCONNESSIONE  TRA LE RETI IDRICHE DI  CANTU' E FIGINO SERENZA","No","A1","A1.1",549901,"",null,"Cantù","NO","Studio di fattibilità",2019,"-","-","-","-","-",0,"-",null,null,null,null,null,null,null,null,0,0,0,0,0,0,80000,0,80000,0]
[null,"103.13041.3","INTERCONNESSIONE  TRA LE RETI IDRICHE DI  CANTU' E CUCCIAGO","No","A1","A1.1",549901,"",null,"Cantù","NO","Studio di fattibilità",2019,"-","-","-","-","-",0,"-",null,null,null,null,null,null,null,null,0,0,0,0,0,0,50000,0,50000,0]
[null,"110.13041.3","Cantù_RETE DI DISTRIBUZIONE - manutenzione straordinaria / rifacimenti (LOTTO 1)","Sì","B4","B4.1",10044,"",null,"Cantù","NO","Progetto preliminare",2019,"-","-","-","-","-","-","-",null,null,null,null,null,null,null,null,0,0,0,0,0,0,40000,0,40000,0]
[null,"205.13041.4","Adeguamento scolmatori consortili (LOTTO 4)","No","C4","C4.2",216510,"",null,"Cantù","NO","",2019,"-","-","-","-","-","1 episodio/anno per scolmatore","-",null,null,null,null,null,null,null,null,0,0,0,0,0,0,120000,0,120000,0]
[null,"202.13041.2","Cantù_RETI FOGNARIE - manutenzione straordinaria (LOTTO 1) - Agglomerato 1","No","C2","C2.1",0,"",null,"Cantù","NO","",2019,"-","-","-","-","-","-","-",null,null,null,null,null,null,null,null,0,0,0,0,0,0,112994.51,0,112994.51,0]
[null,"204.13041.2","Cantù_RETI FOGNARIE - Separazione reti miste - nuove opere (LOTTO 1) - Agglomerato 2","No","C4","C4.1",0,"",null,"Cantù","NO","",2019,"-","-","-","-","-","massimo 1 episodio ogni 2 km di rete fognaria presenti nel Comune","-",null,null,null,null,null,null,null,null,0,0,0,0,0,0,25443.13,0,25443.13,0]
[null,"110.13042.4","Canzo_manutenzione straordinaria reti_via Piave","Sì","B4","B4.1",10044,"",null,"Canzo","NO","Progetto definitivo",2019,"-","-","-","-","-","-","-",null,null,null,null,null,null,null,null,0,0,0,0,0,0,44000,0,44000,0]
[null,"202.13042.3","Canzo_reti fognarie_via Lunate (2° lotto)","No","C2","C2.1",0,"",null,"Canzo","NO","Studio di fattibilità",2019,"-","-","-","-","-","-","-",null,null,null,null,null,null,null,null,0,0,0,0,0,0,170000,0,170000,0]
[null,"205.13042.1","Canzo_SCARICATORI DI PIENA - manutenzione straordinaria (LOTTO 1)","No","C4","C4.2",216510,"",null,"Canzo","NO","",2019,"-","-","-","-","-","1 episodio/anno per scolmatore","-",null,null,null,null,null,null,null,null,0,0,0,0,0,0,21587.5,0,21587.5,0]
[null,"206.13042.1","Canzo_SCARICATORI DI PIENA - nuove opere (inserimento / adeguamento paratoie) (LOTTO 1)","No","C4","C4.2",11407,"",null,"Canzo","NO","",2019,"-","-","-","-","-","1 episodio/anno per scolmatore","-",null,null,null,null,null,null,null,null,0,0,0,0,0,0,6968.5,0,6968.5,0]
[null,"207.13042.1","Canzo_STAZIONI DI SOLLEVAMENTO - manutenzione straordinaria (LOTTO 1)","No","C2","C2.3",4659,"",null,"Canzo","NO","",2019,"-","-","-","-","-","-","-",null,null,null,null,null,null,null,null,0,0,0,0,0,0,4003.5,0,4003.5,0]
[null,"204.13043.1","Capiago Intimiano_RETI FOGNARIE - Separazione reti miste - nuove opere (LOTTO 1)","No","C4","C4.1",0,"",null,"Capiago Intimiano","NO","",2019,"-","-","-","-","-","massimo 1 episodio ogni 2 km di rete fognaria presenti nel Comune","-",null,null,null,null,null,null,null,null,0,0,0,0,0,0,29688.53,0,29688.53,0]
[null,"205.13043.1","Capiago Intimiano_SCARICATORI DI PIENA - manutenzione straordinaria (LOTTO 1)","No","C4","C4.2",216510,"",null,"Capiago Intimiano","NO","",2019,"-","-","-","-","-","1 episodio/anno per scolmatore","-",null,null,null,null,null,null,null,null,0,0,0,0,0,0,15700,0,15700,0]
[null,"206.13043.1","Capiago Intimiano_SCARICATORI DI PIENA - nuove opere (inserimento / adeguamento paratoie) (LOTTO 1)","No","C4","C4.2",11407,"",null,"Capiago Intimiano","NO","",2019,"-","-","-","-","-","1 episodio/anno per scolmatore","-",null,null,null,null,null,null,null,null,0,0,0,0,0,0,5068,0,5068,0]
[null,"207.13043.1","Capiago Intimiano_STAZIONI DI SOLLEVAMENTO - manutenzione straordinaria (LOTTO 1)","No","C2","C2.3",4659,"",null,"Capiago Intimiano","NO","",2019,"-","-","-","-","-","-","-",null,null,null,null,null,null,null,null,0,0,0,0,0,0,4003.5,0,4003.5,0]
[null,"110.13044.1","Carate Urio_RETE DI DISTRIBUZIONE - manutenzione straordinaria / rifacimenti (LOTTO 1)","No","B4","B4.1",10044,"",null,"Carate Urio","NO","",2019,"-","-","-","-","-","-","-",null,null,null,null,null,null,null,null,0,0,0,0,0,0,2160.2399999999998,0,2160.2399999999998,0]
[null,"109.13044.1","Estensione rete cimitero di Cavadino-Via Pangino","No","B7","B7.1",0,"",null,"Carate Urio","NO","",2019,"-","-","-","-","-","-","-",null,null,null,null,null,null,null,null,0,0,0,0,0,0,250000,0,250000,0]
[null,"403.13044.1","Carate Urio_manutenzione generale del depuratore (LOTTO 1)","Sì","D2","D2.9",0,"",null,"Carate Urio","NO","",2019,"-","-","-","-","-","100% giudizi Conformi / Regolamentari","-",null,null,null,null,null,null,null,null,0,0,0,0,0,0,25000,0,25000,0]
[null,"110.13045.1","Carbonate_RETE DI DISTRIBUZIONE - manutenzione straordinaria / rifacimenti (LOTTO 1)","No","B4","B4.1",10044,"",null,"Carbonate","NO","",2019,"-","-","-","-","-","-","-",null,null,null,null,null,null,null,null,0,0,0,0,0,0,5237.6499999999996,0,5237.6499999999996,0]
[null,"111.13046.1","RISTRUTTURAZIONE E ADEGUAMENTO TECNOLOGICO CENTRALE IDRICA \"VALLE SEVESO\" - predisposizioni serbatoio e sollevamenti (LOTTO 2)","No","B8","B8.1",0,"",null,"Carimate","NO","Studio di fattibilità",2019,"-","-","-","-","-","-","-",null,null,null,null,null,null,null,null,0,0,0,0,0,0,50000,0,50000,0]
[null,"302.13046.1","Messa in sicurezza collettori tramite realizzazione di argini ed opere complementari - Tratti vari","No","C2","C2.1",0,"",null,"Carimate","NO","",2019,"-","-","-","-","-","-","-",null,null,null,null,null,null,null,null,0,0,0,0,0,0,50000,0,50000,0]
[null,"202.13046.1","SOSTITUZIONE TRATTO DI FOGNATURA IN VIA DEL GOLF ","Sì","C2","C2.1",0,"",null,"Carimate","NO","",2019,"-","-","-","-","-","-","-",null,null,null,null,null,null,null,null,0,0,0,0,0,0,120000,0,120000,0]
[null,"206.13046.1","Carimate_SCARICATORI DI PIENA - nuove opere (inserimento / adeguamento paratoie)","No","C4","C4.2",11407,"",null,"Carimate","NO","",2019,"-","-","-","-","-","1 episodio/anno per scolmatore","-",null,null,null,null,null,null,null,null,0,0,0,0,0,0,4434.5,0,4434.5,0]
[null,"110.13047.2","SOSTITUZIONE TRATTO TUBAZIONE ACQUEDOTTO SULLE VIE GHIAIE E STAZIONE","Sì","B4","B4.1",10044,"",null,"CARLAZZO","NO","",2019,"-","-","-","-","-","-","-",null,null,null,null,null,null,null,null,0,0,0,0,0,0,27475,0,27475,0]
[null,"403.13047.1","Carlazzo_DEPURATORE ESISTENTE - manutenzione straordinaria complessiva (LOTTO 1)","No","D2","D2.9",0,"",null,"Carlazzo","NO","",2019,"-","-","-","-","-","100% giudizi Conformi / Regolamentari","-",null,null,null,null,null,null,null,null,0,0,0,0,0,0,86910,0,86910,0]
[null,"110.13048.1","Carugo_RETE DI DISTRIBUZIONE - manutenzione straordinaria / rifacimenti (LOTTO 1)","No","B4","B4.1",10044,"",null,"Carugo","NO","",2019,"-","-","-","-","-","-","-",null,null,null,null,null,null,null,null,0,0,0,0,0,0,3885.95,0,3885.95,0]
[null,"205.13048.5","Adeguamento scolmatori consortili (LOTTO 5)","No","C4","C4.2",216510,"",null,"Carugo","NO","",2019,"-","-","-","-","-","1 episodio/anno per scolmatore","-",null,null,null,null,null,null,null,null,0,0,0,0,0,0,120000,0,120000,0]
[null,"205.13048.1","Carugo_SCARICATORI DI PIENA - manutenzione straordinaria (LOTTO 1) - Agglomerato 1","No","C4","C4.2",216510,"",null,"Carugo","NO","",2019,"-","-","-","-","-","1 episodio/anno per scolmatore","-",null,null,null,null,null,null,null,null,0,0,0,0,0,0,15700,0,15700,0]
[null,"110.13050.1","Reti - intervento 1","No","B4","B4.1",10044,"",null,"CASASCO D'INTELVI","NO","",2019,"-","-","-","-","-","-","-",null,null,null,null,null,null,null,null,0,0,0,0,0,0,78500,0,78500,0]
[null,"202.13050.1","Casasco d'Intelvi_RETI FOGNARIE - manutenzione straordinaria (LOTTO 1)","No","C2","C2.1",0,"",null,"Casasco d'Intelvi","NO","",2019,"-","-","-","-","-","-","-",null,null,null,null,null,null,null,null,0,0,0,0,0,0,1303.73,0,1303.73,0]
[null,"102.13052.2","Caslino d'Erba_Pozzo Cascina Mambretti: manutenzione straordinaria","No","A1","A1.1",0,"",null,"Caslino d'Erba","NO","Studio di fattibilità",2019,"-","-","-","-","-",0,"-",null,null,null,null,null,null,null,null,0,0,0,0,0,0,60000,0,60000,0]
[null,"105.13052.1","Caslino d'Erba_Serbatoio Madonnina: manutenzione straordinaria","No","P2","P2.1",0,"",null,"Caslino d'Erba","NO","Studio di fattibilità",2019,"-","-","-","-","-","100% giudizi almeno DISCRETO","-",null,null,null,null,null,null,null,null,0,0,0,0,0,0,8000,0,{"$f":"SUM(AC1275+AE1275+AG1275+AI1275)","v":8000},{"$f":"SUM(AD1275+AF1275+AH1275+AJ1275)","v":0}]
[null,"202.13052.2","Caslino d'Erba_reti fognarie_via Cadorna (LOTTO 2)","No","C2","C2.1",0,"",null,"Caslino d'Erba","NO","Studio di fattibilità",2019,"-","-","-","-","-","-","-",null,null,null,null,null,null,null,null,0,0,0,0,0,0,125000,0,125000,0]
[null,"202.13053.1","Rifacimento fognatura di via Contrada Grande","Sì","C2","C2.1",0,"",null,"Casnate con Bernate","NO","Studio di fattibilità",2019,"-","-","-","-","-","-","-",null,null,null,null,null,null,null,null,0,0,0,0,0,0,45000,0,45000,0]
[null,"202.13053.2","Casnate con Bernate_RETI FOGNARIE - manutenzione straordinaria (LOTTO 1) - Agglomerato 1","No","C2","C2.1",0,"",null,"Casnate con Bernate","NO","",2019,"-","-","-","-","-","-","-",null,null,null,null,null,null,null,null,0,0,0,0,0,0,10788.41,0,10788.41,0]
[null,"204.13053.2","Realizzazione tombinatura via Verdi - Lotto 2","Sì","C4","C4.1",0,"",null,"Casnate con Bernate","NO","Studio di fattibilità",2019,"-","-","-","-","-","massimo 1 episodio ogni 2 km di rete fognaria presenti nel Comune","-",null,null,null,null,null,null,null,null,0,0,0,0,0,0,105000,0,105000,0]
[null,"205.13053.1","Adeguamento scolmatori o punti di scarico delle fognature all'autorizzazione provinciale - Agglomerato 1","Sì","C4","C4.2",216510,"",null,"Casnate con Bernate","NO","",2019,"-","-","-","-","-","1 episodio/anno per scolmatore","-",null,null,null,null,null,null,null,null,0,0,0,0,0,0,15000,0,15000,0]
[null,"205.13053.2","Adeguamento scolmatori o punti di scarico delle fognature all'autorizzazione provinciale - Agglomerato 2","No","C4","C4.2",216510,"",null,"Casnate con Bernate","NO","",2019,"-","-","-","-","-","1 episodio/anno per scolmatore","-",null,null,null,null,null,null,null,null,0,0,0,0,0,0,35000,0,35000,0]
[null,"207.13053.1","Adeguamento stazioni di sollevamento fognatura via Donatello, via Gramsci, via Petrarca, via Carducci, via Macchiavelli","No","C2","C2.3",4659,"",null,"Casnate con Bernate","NO","Studio di fattibilità",2019,"-","-","-","-","-","-","-",null,null,null,null,null,null,null,null,0,0,0,0,0,0,30000,0,30000,0]
[null,"302.13055.1","Nuova opera per risanamento del Collettore Consortile \"Livescia\" (LOTTO 1)","No","C2","C2.1",0,"",null,"Cassina Rizzardi","NO","Progetto preliminare",2019,"-","-","-","-","-","-","-",null,null,null,null,null,null,null,null,0,0,0,0,0,0,400000,0,400000,0]
[null,"110.13059.1","Rifacimento reti in via San Martino, via Cimitero, via Alla Chiesa","No","B4","B4.1",10044,"",null,"Castelnuovo Bozzente","NO","Studio di fattibilità",2019,"-","-","-","-","-","-","-",null,null,null,null,null,null,null,null,0,0,0,0,0,0,200175,0,200175,0]
[null,"111.13059.1","Manutenzione straordinaria e rifacimento impianto elettrico serbatoio acquedotto di via Resegone ","No","B8","B8.1",0,"",null,"Castelnuovo Bozzente","NO","Studio di fattibilità",2019,"-","-","-","-","-","-","-",null,null,null,null,null,null,null,null,0,0,0,0,0,0,36200,0,36200,0]
[null,"110.13060.1","Castiglione d'Intelvi_RETE DI DISTRIBUZIONE - manutenzione straordinaria / rifacimenti (LOTTO 1)","No","B4","B4.1",10044,"",null,"Castiglione d'Intelvi","NO","",2019,"-","-","-","-","-","-","-",null,null,null,null,null,null,null,null,0,0,0,0,0,0,7712.63,0,7712.63,0]
[null,"202.13060.1","Castiglione d'Intelvi_RETI FOGNARIE - manutenzione straordinaria (LOTTO 1)","No","C2","C2.1",0,"",null,"Castiglione d'Intelvi","NO","",2019,"-","-","-","-","-","-","-",null,null,null,null,null,null,null,null,0,0,0,0,0,0,1454.92,0,1454.92,0]
[null,"204.13061.1","Cavallasca_RETI FOGNARIE - Separazione reti miste - nuove opere (LOTTO 1) - AGGLOMERATO 1","No","C4","C4.1",0,"",null,"Cavallasca","NO","",2019,"-","-","-","-","-","massimo 1 episodio ogni 2 km di rete fognaria presenti nel Comune","-",null,null,null,null,null,null,null,null,0,0,0,0,0,0,1346.97,0,1346.97,0]
[null,"204.13061.2","Cavallasca_RETI FOGNARIE - Separazione reti miste - nuove opere (LOTTO 1) - AGGLOMERATO 2","No","C4","C4.1",0,"",null,"Cavallasca","NO","",2019,"-","-","-","-","-","massimo 1 episodio ogni 2 km di rete fognaria presenti nel Comune","-",null,null,null,null,null,null,null,null,0,0,0,0,0,0,15703.23,0,15703.23,0]
[null,"205.13061.1","Cavallasca_SCARICATORI DI PIENA - manutenzione straordinaria (prioritario con attivazione immediata) - Agglomerato 2","No","C4","C4.2",216510,"",null,"Cavallasca","NO","",2019,"-","-","-","-","-","1 episodio/anno per scolmatore","-",null,null,null,null,null,null,null,null,0,0,0,0,0,0,1962.5,0,1962.5,0]
[null,"206.13061.1","Cavallasca_SCARICATORI DI PIENA - nuove opere (inserimento / adeguamento paratoie) (prioritario con attivazione immediata) - Agglomerato 2","No","C4","C4.2",11407,"",null,"Cavallasca","NO","",2019,"-","-","-","-","-","1 episodio/anno per scolmatore","-",null,null,null,null,null,null,null,null,0,0,0,0,0,0,633.5,0,633.5,0]
[null,"100.13062.1","Allacciamenti alla rete acquedottistica","No","-","-",0,"",null,"Cavargna","NO","",2019,"-","-","-","-","-","-","-",null,null,null,null,null,null,null,null,0,0,0,0,0,0,0,19200,0,19200]
[null,"110.13062.1","Cavargna_RETE DI DISTRIBUZIONE - manutenzione straordinaria / rifacimenti (LOTTO 1)","No","B4","B4.1",10044,"",null,"Cavargna","NO","",2019,"-","-","-","-","-","-","-",null,null,null,null,null,null,null,null,0,0,0,0,0,0,68989.33,0,68989.33,0]
[null,"403.13062.1","Cavargna_DEPURATORE ESISTENTE - manutenzione straordinaria complessiva (LOTTO 1)","No","D2","D2.9",0,"",null,"Cavargna","NO","",2019,"-","-","-","-","-","100% giudizi Conformi / Regolamentari","-",null,null,null,null,null,null,null,null,0,0,0,0,0,0,3328.4,0,3328.4,0]
[null,"403.13062.2","Cavargna - Mondrago_DEPURATORE ESISTENTE - manutenzione straordinaria complessiva (LOTTO 1)","No","D2","D2.9",0,"",null,"Cavargna","NO","",2019,"-","-","-","-","-","100% giudizi Conformi / Regolamentari","-",null,null,null,null,null,null,null,null,0,0,0,0,0,0,628,0,628,0]
[null,"403.13062.3","Cavargna - Dosso Finsuè_DEPURATORE ESISTENTE - manutenzione straordinaria complessiva (LOTTO 1)","No","D2","D2.9",0,"",null,"Cavargna","NO","",2019,"-","-","-","-","-","100% giudizi Conformi / Regolamentari","-",null,null,null,null,null,null,null,null,0,0,0,0,0,0,2009.6,0,2009.6,0]
[null,"200.13062.1","Allacciamenti alla rete fognaria","No","-","-",0,"",null,"Cavargna","NO","",2019,"-","-","-","-","-","-","-",null,null,null,null,null,null,null,null,0,0,0,0,0,0,0,24544,0,24544]
[null,"200.13062.2","Allacciamenti alla rete fognaria","No","-","-",0,"",null,"Cavargna","NO","",2019,"-","-","-","-","-","-","-",null,null,null,null,null,null,null,null,0,0,0,0,0,0,0,2832,0,2832]
[null,"200.13062.3","Allacciamenti alla rete fognaria","No","-","-",0,"",null,"Cavargna","NO","",2019,"-","-","-","-","-","-","-",null,null,null,null,null,null,null,null,0,0,0,0,0,0,0,944,0,944]
[null,"201.13062.1","Cavargna_RETI FOGNARIE - Estensione - nuove opere","No","C1","C1.1",0,"",null,"Cavargna","NO","",2019,"-","-","-","-","-","-","-",null,null,null,null,null,null,null,null,0,0,0,0,0,0,108049.73,0,{"$f":"SUM(AC1300+AE1300+AG1300+AI1300)","v":108049.73},{"$f":"SUM(AD1300+AF1300+AH1300+AJ1300)","v":0}]
[null,"201.13062.2","Cavargna - Dosso Finsuè_RETI FOGNARIE - Estensione - nuove opere","No","C1","C1.1",0,"",null,"Cavargna","NO","",2019,"-","-","-","-","-","-","-",null,null,null,null,null,null,null,null,0,0,0,0,0,0,12467.28,0,12467.28,0]
[null,"201.13062.3","Cavargna - Mondrago_RETI FOGNARIE - Estensione - nuove opere","No","C1","C1.1",0,"",null,"Cavargna","NO","",2019,"-","-","-","-","-","-","-",null,null,null,null,null,null,null,null,0,0,0,0,0,0,4155.76,0,4155.76,0]
[null,"202.13062.1","Cavargna_RETI FOGNARIE - manutenzione straordinaria (LOTTO 1) - Agglomerato 1","No","C2","C2.1",0,"",null,"Cavargna","NO","",2019,"-","-","-","-","-","-","-",null,null,null,null,null,null,null,null,0,0,0,0,0,0,924.26,0,924.26,0]
[null,"202.13062.2","Cavargna_RETI FOGNARIE - manutenzione straordinaria (LOTTO 1) - Agglomerato 2","No","C2","C2.1",0,"",null,"Cavargna","NO","",2019,"-","-","-","-","-","-","-",null,null,null,null,null,null,null,null,0,0,0,0,0,0,246.03,0,246.03,0]
[null,"101.13064.1","Adeguamento pozzi (LOTTO 1)","No","A1","A1.4",633,"",null,"Cermenate","NO","Studio di fattibilità",2019,"-","-","-","-","-","-","-",null,null,null,null,null,null,null,null,0,0,0,0,0,0,147062.5,0,147062.5,0]
[null,"110.13064.1","Cermenate_RETE DI DISTRIBUZIONE - manutenzione straordinaria / rifacimenti (LOTTO 1)","Sì","B4","B4.1",10044,"",null,"Cermenate","NO","",2019,"-","-","-","-","-","-","-",null,null,null,null,null,null,null,null,0,0,0,0,0,0,51025,0,51025,0]
[null,"202.13068.1","Cirimido_RETI FOGNARIE - manutenzione straordinaria (LOTTO 1)","No","C2","C2.1",0,"",null,"Cirimido","NO","",2019,"-","-","-","-","-","-","-",null,null,null,null,null,null,null,null,0,0,0,0,0,0,15384.04,0,15384.04,0]
[null,"110.13071.1","Rifacimento tratto di acquedotto da loc. Tufera a bacino Piazza della Beta","No","B4","B4.1",10044,"",null,"CLAINO CON OSTENO","NO","",2019,"-","-","-","-","-","-","-",null,null,null,null,null,null,null,null,0,0,0,0,0,0,62800,0,62800,0]
[null,"110.13074.1","Manutenzione straordinaria rete idrica (LOTTO 1)","No","B4","B4.1",10044,"",null,"COLONNO","NO","Progetto preliminare",2019,"-","-","-","-","-","-","-",null,null,null,null,null,null,null,null,0,0,0,0,0,0,78500,0,78500,0]
[null,"403.13074.1","Colonno_DEPURATORE ESISTENTE - manutenzione straordinaria complessiva (LOTTO 1)","No","D2","D2.9",0,"",null,"Colonno","NO","",2019,"-","-","-","-","-","100% giudizi Conformi / Regolamentari","-",null,null,null,null,null,null,null,null,0,0,0,0,0,0,53682.5,0,53682.5,0]
[null,"302.13074.1","Sostituzione completa collari e sostegni tubazione sub-lacuale","No","C2","C2.1",0,"",null,"Colonno","NO","Progetto preliminare",2019,"-","-","-","-","-","-","-",null,null,null,null,null,null,null,null,0,0,0,0,0,0,50000,0,50000,0]
[null,"302.13251.1","Interventi di potenziamento del sistema di collettamento consortile del Comune di Colverde (LOTTO 2)","No","C2","C2.1",0,"",null,"Colverde","NO","Studio di fattibilità",2019,"-","-","-","-","-","-","-",null,null,null,null,null,null,null,null,0,0,0,0,0,0,1500000,0,1500000,0]
[null,"204.13251.1","Colverde_RETI FOGNARIE - Separazione reti miste - nuove opere (LOTTO 1) - AGGLOMERATO 1","No","C4","C4.1",0,"",null,"Colverde","NO","",2019,"-","-","-","-","-","massimo 1 episodio ogni 2 km di rete fognaria presenti nel Comune","-",null,null,null,null,null,null,null,null,0,0,0,0,0,0,24648.639999999999,0,24648.639999999999,0]
[null,"205.13251.1","Colverde_SCARICATORI DI PIENA - manutenzione straordinaria (LOTTO 1) - Agglomerato 1","No","C4","C4.2",216510,"",null,"Colverde","NO","",2019,"-","-","-","-","-","1 episodio/anno per scolmatore","-",null,null,null,null,null,null,null,null,0,0,0,0,0,0,1962.5,0,1962.5,0]
[null,"206.13251.1","Colverde_SCARICATORI DI PIENA - nuove opere (inserimento / adeguamento paratoie) (prioritario con attivazione immediata) - Agglomerato 1","No","C4","C4.2",11407,"",null,"Colverde","NO","",2019,"-","-","-","-","-","1 episodio/anno per scolmatore","-",null,null,null,null,null,null,null,null,0,0,0,0,0,0,633.5,0,633.5,0]
[null,"403.13075.1","Como_DEPURATORE ESISTENTE - manutenzione straordinaria complessiva (LOTTO 1)","No","D2","D2.9",0,"",null,"Como","NO","",2019,"-","-","-","-","-","100% giudizi Conformi / Regolamentari","-",null,null,null,null,null,null,null,null,0,0,0,0,0,0,1143877.68,0,1143877.68,0]
[null,"202.13075.6","Como_RETI FOGNARIE - manutenzione straordinaria (LOTTO 1) - Agglomerato 2","No","C2","C2.1",0,"",null,"Como","NO","",2019,"-","-","-","-","-","-","-",null,null,null,null,null,null,null,null,0,0,0,0,0,0,171102.86,0,171102.86,0]
[null,"204.13075.4","Fognatura nera via Pannillani - S. Martino","Sì","C4","C4.1",0,"",null,"Como","NO","",2019,"-","-","-","-","-","massimo 1 episodio ogni 2 km di rete fognaria presenti nel Comune","-",null,null,null,null,null,null,null,null,0,0,0,0,0,0,50000,0,50000,0]
[null,"204.13075.5","Como_RETI FOGNARIE - Separazione reti miste - nuove opere (LOTTO 1) - Agglomerato 3","No","C4","C4.1",0,"",null,"Como","NO","",2019,"-","-","-","-","-","massimo 1 episodio ogni 2 km di rete fognaria presenti nel Comune","-",null,null,null,null,null,null,null,null,0,0,0,0,0,0,12667.4,0,12667.4,0]
[null,"205.13075.1","Como_SCARICATORI DI PIENA - manutenzione straordinaria (LOTTO 1) - Agglomerato 2","No","C4","C4.2",216510,"",null,"Como","NO","",2019,"-","-","-","-","-","1 episodio/anno per scolmatore","-",null,null,null,null,null,null,null,null,0,0,0,0,0,0,51025,0,51025,0]
[null,"205.13075.2","Como_SCARICATORI DI PIENA - manutenzione straordinaria (LOTTO 1) - Agglomerato 3","No","C4","C4.2",216510,"",null,"Como","NO","",2019,"-","-","-","-","-","1 episodio/anno per scolmatore","-",null,null,null,null,null,null,null,null,0,0,0,0,0,0,3925,0,3925,0]
[null,"110.13077.1","Corrido_RETE DI DISTRIBUZIONE - manutenzione straordinaria / rifacimenti (LOTTO 1)","No","B4","B4.1",10044,"",null,"Corrido","NO","",2019,"-","-","-","-","-","-","-",null,null,null,null,null,null,null,null,0,0,0,0,0,0,8811.9500000000007,0,8811.9500000000007,0]
[null,"111.13077.5","MANUTENZIONE STRAORDINARIA BACINO IDRICO FRAZIONE MOLZANO","No","B8","B8.1",0,"",null,"Corrido","NO","",2019,"-","-","-","-","-","-","-",null,null,null,null,null,null,null,null,0,0,0,0,0,0,9000,0,9000,0]
[null,"101.13083.1","MANUTENZIONE STRAORDINARIA CAPTAZIONI","No","A1","A1.4",633,"",null,"CREMIA","NO","Studio di fattibilità",2019,"-","-","-","-","-","-","-",null,null,null,null,null,null,null,null,0,0,0,0,0,0,181000,0,181000,0]
[null,"110.13083.1","MANUTENZIONE STRAORDINARIA RETE DI ADDUZIONE E DI DISTRIBUZIONE","No","B4","B4.1",10044,"",null,"CREMIA","NO","Studio di fattibilità",2019,"-","-","-","-","-","-","-",null,null,null,null,null,null,null,null,0,0,0,0,0,0,235500,0,235500,0]
[null,"202.13083.1","Efficientamento rete fognaria località Prato e dismissione stazione di sollevamento","No","C2","C2.1",0,"",null,"Cremia","NO","Studio di fattibilità",2019,"-","-","-","-","-","-","-",null,null,null,null,null,null,null,null,0,0,0,0,0,0,100000,0,100000,0]
[null,"101.13084.1","adeguamento zona di tutela assoluta pozzo via Navedano","No","A1","A1.4",633,"",null,"Cucciago","NO","Studio di fattibilità",2019,"-","-","-","-","-","-","-",null,null,null,null,null,null,null,null,0,0,0,0,0,0,36200,0,36200,0]
[null,"110.13084.2","Rifacimento e adeguamento rete acquedotto via Raffaello e formazione di anello con condotta di via Navedano","No","B4","B4.1",10044,"",null,"Cucciago","NO","Studio di fattibilità",2019,"-","-","-","-","-","-","-",null,null,null,null,null,null,null,null,0,0,0,0,0,0,50000,0,50000,0]
[null,"100.13085.1","Allacciamenti alla rete acquedottistica","No","-","-",0,"",null,"Cusino","NO","",2019,"-","-","-","-","-","-","-",null,null,null,null,null,null,null,null,0,0,0,0,0,0,0,11200,0,11200]
[null,"110.13085.1","Cusino_RETE DI DISTRIBUZIONE - manutenzione straordinaria / rifacimenti (LOTTO 1)","No","B4","B4.1",10044,"",null,"Cusino","NO","",2019,"-","-","-","-","-","-","-",null,null,null,null,null,null,null,null,0,0,0,0,0,0,39964.74,0,39964.74,0]
[null,"200.13085.1","Allacciamenti alla rete fognaria","No","-","-",0,"",null,"Cusino","NO","",2019,"-","-","-","-","-","-","-",null,null,null,null,null,null,null,null,0,0,0,0,0,0,0,16520,0,16520]
[null,"201.13085.1","Cusino_RETI FOGNARIE - Estensione - nuove opere","Sì","C1","C1.1",0,17,"rilevata","Cusino","NO","",2019,"-","-","-","-","-","-","-",null,null,null,null,null,null,null,null,0,0,0,0,0,0,55657.5,0,55657.5,0]
[null,"202.13085.1","Cusino_RETI FOGNARIE - manutenzione straordinaria (LOTTO 1)","No","C2","C2.1",0,"",null,"Cusino","NO","",2019,"-","-","-","-","-","-","-",null,null,null,null,null,null,null,null,0,0,0,0,0,0,963.43,0,963.43,0]
[null,"110.13087.1","Rifacimento linea acquedotto comunale Via Mulini - Via Masciadri, Piazza Centrale, Piazza Inganni, Via Longoni - centro paese Dizzasco.","No","B4","B4.1",10044,"",null,"Dizzasco","NO","",2019,"-","-","-","-","-","-","-",null,null,null,null,null,null,null,null,0,0,0,0,0,0,150000,0,150000,0]
[null,"204.13087.1","Formazione nuova linea fognatura comunale Via Mulini - Via Masciadri - Piazza Centrale - Via Longoni  mediante separazione delle acque chiare.","No","C4","C4.1",0,"",null,"Dizzasco","NO","",2019,"-","-","-","-","-","massimo 1 episodio ogni 2 km di rete fognaria presenti nel Comune","-",null,null,null,null,null,null,null,null,0,0,0,0,0,0,350000,0,350000,0]
[null,"202.13089.1","Domaso_RETI FOGNARIE - manutenzione straordinaria (LOTTO 1)","No","C2","C2.1",0,"",null,"Domaso","NO","",2019,"-","-","-","-","-","-","-",null,null,null,null,null,null,null,null,0,0,0,0,0,0,2531.39,0,2531.39,0]
[null,"201.13090.2","LAVORI DI COSTRUZIONE FOGNATURA IN LOCALITA' CROTTI","No","C1","C1.1",0,"",null,"Dongo","NO","Progetto preliminare",2019,"-","-","-","-","-","-","-",null,null,null,null,null,null,null,null,0,0,0,0,0,0,273000,0,273000,0]
[null,"202.13090.1","Dongo_RETI FOGNARIE - manutenzione straordinaria (LOTTO 1)","No","C2","C2.1",0,"",null,"Dongo","NO","",2019,"-","-","-","-","-","-","-",null,null,null,null,null,null,null,null,0,0,0,0,0,0,3664.85,0,3664.85,0]
[null,"110.13092.2","Dosso del Liro_RETE DI DISTRIBUZIONE - manutenzione straordinaria / rifacimenti (LOTTO 1)","No","B4","B4.1",10044,"",null,"Dosso del Liro","NO","",2019,"-","-","-","-","-","-","-",null,null,null,null,null,null,null,null,0,0,0,0,0,0,58429.91,0,58429.91,0]
[null,"202.13092.1","Dosso del Liro_RETI FOGNARIE - manutenzione straordinaria (LOTTO 1)","No","C2","C2.1",0,"",null,"Dosso del Liro","NO","",2019,"-","-","-","-","-","-","-",null,null,null,null,null,null,null,null,0,0,0,0,0,0,508.21,0,508.21,0]
[null,"110.13095.4","VIA UGO FOSCOLO","Sì","B4","B4.1",10044,"",null,"Erba","NO","Progetto preliminare",2019,"-","-","-","-","-","-","-",null,null,null,null,null,null,null,null,0,0,0,0,0,0,20000,0,20000,0]
[null,"110.13095.5","VIA BRUGORA","Sì","B4","B4.1",10044,"",null,"Erba","NO","Progetto preliminare",2019,"-","-","-","-","-","-","-",null,null,null,null,null,null,null,null,0,0,0,0,0,0,35000,0,35000,0]
[null,"206.13095.1","Erba_SCARICATORI DI PIENA - nuove opere (inserimento / adeguamento paratoie)","No","C4","C4.2",11407,"",null,"Erba","NO","",2019,"-","-","-","-","-","1 episodio/anno per scolmatore","-",null,null,null,null,null,null,null,null,0,0,0,0,0,0,8235.5,0,8235.5,0]
[null,"205.13097.1","Eupilio_SCARICATORI DI PIENA - manutenzione straordinaria","No","C4","C4.2",216510,"",null,"Eupilio","NO","",2019,"-","-","-","-","-","1 episodio/anno per scolmatore","-",null,null,null,null,null,null,null,null,0,0,0,0,0,0,9812.5,0,9812.5,0]
[null,"110.13098.1","Faggeto Lario_RETE DI DISTRIBUZIONE - manutenzione straordinaria / rifacimenti (LOTTO 1)","No","B4","B4.1",10044,"",null,"Faggeto Lario","NO","",2019,"-","-","-","-","-","-","-",null,null,null,null,null,null,null,null,0,0,0,0,0,0,10098.950000000001,0,10098.950000000001,0]
[null,"202.13098.1","Faggeto Lario_RETI FOGNARIE - manutenzione straordinaria (LOTTO 1)","No","C2","C2.1",0,"",null,"Faggeto Lario","NO","",2019,"-","-","-","-","-","-","-",null,null,null,null,null,null,null,null,0,0,0,0,0,0,1925.21,0,1925.21,0]
[null,"110.13099.3","Tubazione rete acquedotto via Montebello","Sì","B4","B4.1",10044,"",null,"FALOPPIO","NO","Studio di fattibilità",2019,"-","-","-","-","-","-","-",null,null,null,null,null,null,null,null,0,0,0,0,0,0,30000,0,30000,0]
[null,"202.13099.1","Faloppio_RETI FOGNARIE - manutenzione straordinaria (LOTTO 1)","No","C2","C2.1",0,"",null,"Faloppio","NO","",2019,"-","-","-","-","-","-","-",null,null,null,null,null,null,null,null,0,0,0,0,0,0,22949.48,0,22949.48,0]
[null,"111.13100.2","Adeguamento strutturale serbatoio via Montegrappa","No","B8","B8.1",0,"",null,"Fenegrò","NO","Studio di fattibilità",2019,"-","-","-","-","-","-","-",null,null,null,null,null,null,null,null,0,0,0,0,0,0,235300,0,235300,0]
[null,"205.13101.1","Rifacimento degli scaricatori di piena in Via Como.","No","C4","C4.2",216510,"",null,"Figino Serenza","NO","",2019,"-","-","-","-","-","1 episodio/anno per scolmatore","-",null,null,null,null,null,null,null,null,0,0,0,0,0,0,50000,0,50000,0]
[null,"207.13101.1","Manutenzione strordinaria degli impianti elettrici ed idraulici delle stazioni di sollevamento (via Po).","Sì","C2","C2.3",4659,"",null,"Figino Serenza","NO","",2019,"-","-","-","-","-","-","-",null,null,null,null,null,null,null,null,0,0,0,0,0,0,8000,0,8000,0]
[null,"207.13101.2","Figino Serenza_STAZIONI DI SOLLEVAMENTO - manutenzione straordinaria (LOTTO 1)","No","C2","C2.3",4659,"",null,"Figino Serenza","NO","",2019,"-","-","-","-","-","-","-",null,null,null,null,null,null,null,null,0,0,0,0,0,0,6407,0,6407,0]
[null,"110.13102.4","Rifacimento reti in via Sassi","No","B4","B4.1",10044,"",null,"Fino Mornasco","NO","Studio di fattibilità",2019,"-","-","-","-","-","-","-",null,null,null,null,null,null,null,null,0,0,0,0,0,0,200000,0,200000,0]
[null,"403.13102.1","Ammodernamento ispessitore fanghi","No","D2","D2.9",0,"",null,"Fino Mornasco","NO","",2019,"-","-","-","-","-","100% giudizi Conformi / Regolamentari","-",null,null,null,null,null,null,null,null,0,0,0,0,0,0,25000,0,25000,0]
[null,"403.13102.3","Adeguamento stazione di disidratazione fanghi","No","D2","D2.9",0,"",null,"Fino Mornasco","NO","",2019,"-","-","-","-","-","100% giudizi Conformi / Regolamentari","-",null,null,null,null,null,null,null,null,0,0,0,0,0,0,120000,0,120000,0]
[null,"405.13102.1","Realizzazione vasca di accumulo delle acque di pioggia","No","D6","D6.3",0,"",null,"Fino Mornasco","NO","Studio di fattibilità",2019,"-","-","-","-","-","1 episodio/anno per depuratore","-",null,null,null,null,null,null,null,null,0,0,0,0,0,0,925000,0,925000,0]
[null,"206.13102.1","Fino Mornasco_SCARICATORI DI PIENA - nuove opere (inserimento / adeguamento paratoie) (LOTTO 1) - Agglomerato 1","No","C4","C4.2",11407,"",null,"Fino Mornasco","NO","",2019,"-","-","-","-","-","1 episodio/anno per scolmatore","-",null,null,null,null,null,null,null,null,0,0,0,0,0,0,2534,0,2534,0]
[null,"206.13102.2","Fino Mornasco_SCARICATORI DI PIENA - nuove opere (inserimento / adeguamento paratoie) (LOTTO 1) - Agglomerato 2","No","C4","C4.2",11407,"",null,"Fino Mornasco","NO","",2019,"-","-","-","-","-","1 episodio/anno per scolmatore","-",null,null,null,null,null,null,null,null,0,0,0,0,0,0,633.5,0,633.5,0]
[null,"206.13102.3","Fino Mornasco_SCARICATORI DI PIENA - nuove opere (inserimento / adeguamento paratoie) (LOTTO 1) - Agglomerato 3","No","C4","C4.2",11407,"",null,"Fino Mornasco","NO","",2019,"-","-","-","-","-","1 episodio/anno per scolmatore","-",null,null,null,null,null,null,null,null,0,0,0,0,0,0,3801,0,3801,0]
[null,"206.13102.4","Fino Mornasco_SCARICATORI DI PIENA - nuove opere (inserimento / adeguamento paratoie) (LOTTO 1) - Agglomerato 4","No","C4","C4.2",11407,"",null,"Fino Mornasco","NO","",2019,"-","-","-","-","-","1 episodio/anno per scolmatore","-",null,null,null,null,null,null,null,null,0,0,0,0,0,0,6335,0,6335,0]
[null,"100.13106.1","Allacciamenti alla rete acquedottistica","No","-","-",0,"",null,"Garzeno","NO","",2019,"-","-","-","-","-","-","-",null,null,null,null,null,null,null,null,0,0,0,0,0,0,0,19200,0,19200]
[null,"110.13106.1","Rifacimento rete adduttrice da nr. quattro sorgenti post in loc. Colorina, Lami M. (Beltramet), Lesole, Cagerino a vasche di distribuzione (LOTTO 1)","No","B4","B4.1",10044,"",null,"GARZENO","NO","Studio di fattibilità",2019,"-","-","-","-","-","-","-",null,null,null,null,null,null,null,null,0,0,0,0,0,0,314000,0,314000,0]
[null,"200.13106.1","Allacciamenti alla rete fognaria","No","-","-",0,"",null,"Garzeno","NO","",2019,"-","-","-","-","-","-","-",null,null,null,null,null,null,null,null,0,0,0,0,0,0,0,28320,0,28320]
[null,"303.13106.1","Garzeno_NUOVA DORSALE DI COLLETTAMENTO - attuazione schema/pianificazione","Sì","D2","D2.4",0,"",null,"Garzeno","NO","",2019,"-","-","-","-","-","-","-",null,null,null,null,null,null,null,null,0,0,0,0,0,0,250000,0,250000,0]
[null,"201.13106.1","Garzeno_RETI FOGNARIE - Estensione - nuove opere","Sì","C1","C1.1",0,30,"rilevata","Garzeno","NO","",2019,"-","-","-","-","-","-","-",null,null,null,null,null,null,null,null,0,0,0,0,0,0,27233.62,0,27233.62,0]
[null,"403.13107.1","ADEGUAMENTO E POTENZIAMENTO DEPURATORE SANT'AGATA","Sì","D2","D2.9",0,"",null,"Gera Lario","NO","",2019,"-","-","-","-","-","100% giudizi Conformi / Regolamentari","-",null,null,null,null,null,null,null,null,0,0,0,0,0,0,200000,0,200000,0]
[null,"301.13107.1","OPERE DI ADEGUAMENTO E RIFACIMENTO COLLETTORE LUNGO LAGO - PORTO","No","C2","C2.8",178757,"",null,"GERA LARIO","NO","",2019,"-","-","-","-","-","-","-",null,null,null,null,null,null,null,null,0,0,0,0,0,0,450000,0,450000,0]
[null,"202.13107.1","Gera Lario_RETI FOGNARIE - manutenzione straordinaria (LOTTO 1) - Agglomerato 2","No","C2","C2.1",0,"",null,"Gera Lario","NO","",2019,"-","-","-","-","-","-","-",null,null,null,null,null,null,null,null,0,0,0,0,0,0,2220.13,0,2220.13,0]
[null,"202.13107.2","Gera Lario_RETI FOGNARIE - manutenzione straordinaria (LOTTO 1) - Agglomerato 4","No","C2","C2.1",0,"",null,"Gera Lario","NO","",2019,"-","-","-","-","-","-","-",null,null,null,null,null,null,null,null,0,0,0,0,0,0,701.48,0,701.48,0]
[null,"202.13110.2","Grandate_RETI FOGNARIE - manutenzione straordinaria (LOTTO 1) - Agglomerato 2","No","C2","C2.1",0,"",null,"Grandate","NO","",2019,"-","-","-","-","-","-","-",null,null,null,null,null,null,null,null,0,0,0,0,0,0,26182.86,0,26182.86,0]
[null,"204.13110.2","Grandate_RETI FOGNARIE - Separazione reti miste - nuove opere (LOTTO 1) - Agglomerato 1","No","C4","C4.1",0,"",null,"Grandate","NO","",2019,"-","-","-","-","-","massimo 1 episodio ogni 2 km di rete fognaria presenti nel Comune","-",null,null,null,null,null,null,null,null,0,0,0,0,0,0,3696.51,0,3696.51,0]
[null,"109.13111.1","POTENZIAMENTO NUOVA RETE IDRICA","No","B7","B7.1",0,"",null,"Grandola ed Uniti","NO","Progetto preliminare",2019,"-","-","-","-","-","-","-",null,null,null,null,null,null,null,null,0,0,0,0,0,0,60000,0,60000,0]
[null,"110.13249.2","Rifacimento della rete acquedottistica comunale nella linea di loc. Siee","No","B4","B4.1",10044,"",null,"Gravedona ed Uniti","NO","Studio di fattibilità",2019,"-","-","-","-","-","-","-",null,null,null,null,null,null,null,null,0,0,0,0,0,0,117750,0,117750,0]
[null,"402.13249.2","Creazione Platea","No","D2","D2.2",0,"",null,"Gravedona ed Uniti","NO","Progetto preliminare",2019,"-","-","-","-","-","-","-",null,null,null,null,null,null,null,null,0,0,0,0,0,0,10000,0,10000,0]
[null,"403.13249.2"," creazione nuova tubazione a servizio delle vasche di ossidazione e adeguamento sistema di areazione ossidazione","No","D2","D2.9",0,"",null,"Gravedona ed Uniti","NO","Progetto preliminare",2019,"-","-","-","-","-","100% giudizi Conformi / Regolamentari","-",null,null,null,null,null,null,null,null,0,0,0,0,0,0,150000,0,150000,0]
[null,"406.13249.1","Telecontrollo e telegestione","No","K3","K3.1",0,"",null,"Gravedona ed Uniti","N.A.","",2019,"-","-","-","-","-","-","-",null,null,null,null,null,null,null,null,0,0,0,0,0,0,150000,0,150000,0]
[null,"202.13113.1","Griante_RETI FOGNARIE - manutenzione straordinaria (LOTTO 1)","No","C2","C2.1",0,"",null,"Griante","NO","",2019,"-","-","-","-","-","-","-",null,null,null,null,null,null,null,null,0,0,0,0,0,0,1124.75,0,1124.75,0]
[null,"202.13114.3","condotte in fascia di rispetto pozzo XX Settembre - Intervento 1","No","C2","C2.1",0,"",null,"Guanzate","NO","Studio di fattibilità",2019,"-","-","-","-","-","-","-",null,null,null,null,null,null,null,null,0,0,0,0,0,0,409037.5,0,409037.5,0]
[null,"205.13114.1","Scolmatore via S.Giuseppe - Adeguamento opera civile","No","C4","C4.2",216510,"",null,"Guanzate","NO","",2019,"-","-","-","-","-","1 episodio/anno per scolmatore","-",null,null,null,null,null,null,null,null,0,0,0,0,0,0,18000,0,18000,0]
[null,"207.13114.1","Guanzate_STAZIONI DI SOLLEVAMENTO - manutenzione straordinaria (LOTTO 1)","No","C2","C2.3",4659,"",null,"Guanzate","NO","",2019,"-","-","-","-","-","-","-",null,null,null,null,null,null,null,null,0,0,0,0,0,0,4003.5,0,4003.5,0]
[null,"110.13118.3","Rifacimento rete acquedotto via Ferrera","Sì","B4","B4.1",10044,"",null,"Inverigo","NO","",2019,"-","-","-","-","-","-","-",null,null,null,null,null,null,null,null,0,0,0,0,0,0,27475,0,27475,0]
[null,"302.13118.1","Risanamento collettore Inverigo-Nibionno","No","C2","C2.1",0,"",null,"INVERIGO","NO","Studio di fattibilità",2019,"-","-","-","-","-","-","-",null,null,null,null,null,null,null,null,0,0,0,0,0,0,300000,0,300000,0]
[null,"204.13118.1","Inverigo_RETI FOGNARIE - Separazione reti miste - nuove opere (LOTTO 1) - Agglomerato 1","No","C4","C4.1",0,"",null,"Inverigo","NO","",2019,"-","-","-","-","-","massimo 1 episodio ogni 2 km di rete fognaria presenti nel Comune","-",null,null,null,null,null,null,null,null,0,0,0,0,0,0,15622.22,0,15622.22,0]
[null,"406.13120.1","Lavori di manutenzione straordinaria -- civili -- ed adeguamento tecnologico con installazione telecontrollo","Sì","K3","K3.1",0,"",null,"LAINO","N.A.","Studio di fattibilità",2019,"-","-","-","-","-","-","-",null,null,null,null,null,null,null,null,0,0,0,0,0,0,35000,0,35000,0]
[null,"202.13120.1","Laino_RETI FOGNARIE - manutenzione straordinaria (LOTTO 1)","No","C2","C2.1",0,"",null,"Laino","NO","",2019,"-","-","-","-","-","-","-",null,null,null,null,null,null,null,null,0,0,0,0,0,0,1704.31,0,1704.31,0]
[null,"202.13121.2","Lambrugo_RETI FOGNARIE - manutenzione straordinaria (LOTTO 1) - Agglomerato 2","No","C2","C2.1",0,"",null,"Lambrugo","NO","",2019,"-","-","-","-","-","-","-",null,null,null,null,null,null,null,null,0,0,0,0,0,0,13456.88,0,13456.88,0]
[null,"403.13122.1","Lanzo d'Intelvi_DEPURATORE ESISTENTE - manutenzione straordinaria complessiva (LOTTO 1)","No","D2","D2.9",0,"",null,"Lanzo d'Intelvi","NO","",2019,"-","-","-","-","-","100% giudizi Conformi / Regolamentari","-",null,null,null,null,null,null,null,null,0,0,0,0,0,0,24727.5,0,24727.5,0]
[null,"108.13123.1","telecontrollo acquedotto","Sì","K3","K3.1",0,"",null,"LASNIGO","N.A.","",2019,"-","-","-","-","-","-","-",null,null,null,null,null,null,null,null,0,0,0,0,0,0,27150,0,27150,0]
[null,"111.13126.1","Ristrutturazione serbatoi esistenti in località Madonna dei Ceppi e Calvasino","No","B8","B8.1",0,"",null,"Lezzeno","NO","Studio di fattibilità",2019,"-","-","-","-","-","-","-",null,null,null,null,null,null,null,null,0,0,0,0,0,0,80000,0,80000,0]
[null,"111.13128.1","Adeguamento serbatoi","No","B8","B8.1",0,"",null,"Limido Comasco","NO","Studio di fattibilità",2019,"-","-","-","-","-","-","-",null,null,null,null,null,null,null,null,0,0,0,0,0,0,58825,0,58825,0]
[null,"403.13128.1","Riciclo fanghi","No","D2","D2.9",0,"",null,"Limido Comasco","NO","Progetto preliminare",2019,"-","-","-","-","-","100% giudizi Conformi / Regolamentari","-",null,null,null,null,null,null,null,null,0,0,0,0,0,0,45000,0,45000,0]
[null,"403.13128.3","Impianti elettrici e automazione","No","D2","D2.9",0,"",null,"Limido Comasco","NO","Progetto preliminare",2019,"-","-","-","-","-","100% giudizi Conformi / Regolamentari","-",null,null,null,null,null,null,null,null,0,0,0,0,0,0,80000,0,80000,0]
[null,"202.13128.1","Limido Comasco_RETI FOGNARIE - manutenzione straordinaria (LOTTO 1)","No","C2","C2.1",0,"",null,"Limido Comasco","NO","",2019,"-","-","-","-","-","-","-",null,null,null,null,null,null,null,null,0,0,0,0,0,0,20050.47,0,20050.47,0]
[null,"204.13128.1","Limido Comasco_RETI FOGNARIE - Separazione reti miste - nuove opere (LOTTO 1)","No","C4","C4.1",0,"",null,"Limido Comasco","NO","",2019,"-","-","-","-","-","massimo 1 episodio ogni 2 km di rete fognaria presenti nel Comune","-",null,null,null,null,null,null,null,null,0,0,0,0,0,0,23115.51,0,23115.51,0]
[null,"110.13129.2","Rete idrica via Meleer","Sì","B4","B4.1",10044,"",null,"Lipomo","NO","Progetto preliminare",2019,"-","-","-","-","-","-","-",null,null,null,null,null,null,null,null,0,0,0,0,0,0,19625,0,19625,0]
[null,"202.13129.1","STAZIONE SOLLEVAMENTO FOGNATURA VIA OLIMPICA","No","C2","C2.1",0,"",null,"Lipomo","NO","Progetto preliminare",2019,"-","-","-","-","-","-","-",null,null,null,null,null,null,null,null,0,0,0,0,0,0,250000,0,250000,0]
[null,"207.13129.1","STAZIONE SOLLEVAMENTO FOGNATURA LOC. CIMITERO","No","C2","C2.3",4659,"",null,"Lipomo","NO","",2019,"-","-","-","-","-","-","-",null,null,null,null,null,null,null,null,0,0,0,0,0,0,22000,0,22000,0]
[null,"110.13130.1","Livo_RETE DI DISTRIBUZIONE - manutenzione straordinaria / rifacimenti (LOTTO 1)","No","B4","B4.1",10044,"",null,"Livo","NO","",2019,"-","-","-","-","-","-","-",null,null,null,null,null,null,null,null,0,0,0,0,0,0,59622.71,0,59622.71,0]
[null,"202.13130.1","Livo_RETI FOGNARIE - manutenzione straordinaria (LOTTO 1)","No","C2","C2.1",0,"",null,"Livo","NO","",2019,"-","-","-","-","-","-","-",null,null,null,null,null,null,null,null,0,0,0,0,0,0,415.19,0,415.19,0]
[null,"110.13131.2","Potenziamento via Dei Ronchi","Sì","B4","B4.1",10044,"",null,"Locate Varesino","NO","",2019,"-","-","-","-","-","-","-",null,null,null,null,null,null,null,null,0,0,0,0,0,0,22385.45,0,22385.45,0]
[null,"204.13131.1","Locate Varesino_RETI FOGNARIE - Separazione reti miste - nuove opere (LOTTO 1)","No","C4","C4.1",0,"",null,"Locate Varesino","NO","",2019,"-","-","-","-","-","massimo 1 episodio ogni 2 km di rete fognaria presenti nel Comune","-",null,null,null,null,null,null,null,null,0,0,0,0,0,0,15785.01,0,15785.01,0]
[null,"202.13133.5","Realizzazione dorsale posata lungo il ciglio della scarpata della valle del Lura in frazione Manera da via Aurora al nuovo scolmatore in via Piave","No","C2","C2.1",0,"",null,"Lomazzo","NO","Studio di fattibilità",2019,"-","-","-","-","-","-","-",null,null,null,null,null,null,null,null,0,0,0,0,0,0,604086.85,0,604086.85,0]
[null,"204.13134.1","Longone al Segrino_RETI FOGNARIE - Separazione reti miste - nuove opere (LOTTO 1)","No","C4","C4.1",0,"",null,"Longone al Segrino","NO","",2019,"-","-","-","-","-","massimo 1 episodio ogni 2 km di rete fognaria presenti nel Comune","-",null,null,null,null,null,null,null,null,0,0,0,0,0,0,5685.21,0,5685.21,0]
[null,"204.13135.1","Luisago_RETI FOGNARIE - Separazione reti miste - nuove opere (LOTTO 1)","No","C4","C4.1",0,"",null,"Luisago","NO","",2019,"-","-","-","-","-","massimo 1 episodio ogni 2 km di rete fognaria presenti nel Comune","-",null,null,null,null,null,null,null,null,0,0,0,0,0,0,18316.75,0,18316.75,0]
[null,"204.13136.1","Lurago d'Erba_RETI FOGNARIE - Separazione reti miste - nuove opere (LOTTO 1) - Agglomerato 1","No","C4","C4.1",0,"",null,"Lurago d'Erba","NO","",2019,"-","-","-","-","-","massimo 1 episodio ogni 2 km di rete fognaria presenti nel Comune","-",null,null,null,null,null,null,null,null,0,0,0,0,0,0,5244.36,0,5244.36,0]
[null,"204.13136.2","Lurago d'Erba_RETI FOGNARIE - Separazione reti miste - nuove opere (LOTTO 1) - Agglomerato 2","No","C4","C4.1",0,"",null,"Lurago d'Erba","NO","",2019,"-","-","-","-","-","massimo 1 episodio ogni 2 km di rete fognaria presenti nel Comune","-",null,null,null,null,null,null,null,null,0,0,0,0,0,0,16939.91,0,16939.91,0]
[null,"110.13137.1","Lurago Marinone_RETE DI DISTRIBUZIONE - manutenzione straordinaria / rifacimenti (LOTTO 1)","Sì","B4","B4.1",10044,"",null,"Lurago Marinone","NO","",2019,"-","-","-","-","-","-","-",null,null,null,null,null,null,null,null,0,0,0,0,0,0,17654.650000000001,0,17654.650000000001,0]
[null,"111.13137.1","Adeguamento serbatoi","No","B8","B8.1",0,"",null,"Lurago Marinone","NO","Studio di fattibilità",2019,"-","-","-","-","-","-","-",null,null,null,null,null,null,null,null,0,0,0,0,0,0,117650,0,117650,0]
[null,"204.13137.1","Lurago Marinone_RETI FOGNARIE - Separazione reti miste - nuove opere (LOTTO 1)","No","C4","C4.1",0,"",null,"Lurago Marinone","NO","",2019,"-","-","-","-","-","massimo 1 episodio ogni 2 km di rete fognaria presenti nel Comune","-",null,null,null,null,null,null,null,null,0,0,0,0,0,0,20107.29,0,20107.29,0]
[null,"205.13137.1","Lurago Marinone_SCARICATORI DI PIENA - manutenzione straordinaria (LOTTO 1)","No","C4","C4.2",216510,"",null,"Lurago Marinone","NO","",2019,"-","-","-","-","-","1 episodio/anno per scolmatore","-",null,null,null,null,null,null,null,null,0,0,0,0,0,0,5887.5,0,5887.5,0]
[null,"110.13138.2","Rifacimento reti acquedotto di via Olgiate interna (da ex Enfapi a via Dalca), via Plinio (tratto tra via XX Settembre e via Campo Sportivo), via Olgiate, via Per Gironico","No","B4","B4.1",10044,"",null,"Lurate Caccivio","NO","Studio di fattibilità",2019,"-","-","-","-","-","-","-",null,null,null,null,null,null,null,null,0,0,0,0,0,0,274750,0,274750,0]
[null,"202.13138.2","Rifacimento collettore comunale in via Colombo","Sì","C2","C2.1",0,"",null,"Lurate Caccivio","NO","Studio di fattibilità",2019,"-","-","-","-","-","-","-",null,null,null,null,null,null,null,null,0,0,0,0,0,0,100000,0,100000,0]
[null,"205.13139.1","Magreglio_SCARICATORI DI PIENA - manutenzione straordinaria (LOTTO 1)","No","C4","C4.2",216510,"",null,"Magreglio","NO","",2019,"-","-","-","-","-","1 episodio/anno per scolmatore","-",null,null,null,null,null,null,null,null,0,0,0,0,0,0,3925,0,3925,0]
[null,"206.13139.1","Magreglio_SCARICATORI DI PIENA - nuove opere (inserimento / adeguamento paratoie) (LOTTO 1)","No","C4","C4.2",11407,"",null,"Magreglio","NO","",2019,"-","-","-","-","-","1 episodio/anno per scolmatore","-",null,null,null,null,null,null,null,null,0,0,0,0,0,0,1267,0,1267,0]
[null,"403.13143.1","Nuovo estrattore centrifugo per disidratazione dei fanghi ispessiti","No","D2","D2.9",0,"",null,"Mariano Comense","NO","Studio di fattibilità",2019,"-","-","-","-","-","100% giudizi Conformi / Regolamentari","-",null,null,null,null,null,null,null,null,0,0,0,0,0,0,290000,0,290000,0]
[null,"403.13143.2","Secondo lotto filtrazione finale e chiariflocculazione","No","D2","D2.9",0,"",null,"Mariano Comense","NO","Studio di fattibilità",2019,"-","-","-","-","-","100% giudizi Conformi / Regolamentari","-",null,null,null,null,null,null,null,null,0,0,0,0,0,0,400000,0,400000,0]
[null,"205.13143.6","Adeguamento scolmatori consortili (LOTTO 6)","No","C4","C4.2",216510,"",null,"Mariano Comense","NO","",2019,"-","-","-","-","-","1 episodio/anno per scolmatore","-",null,null,null,null,null,null,null,null,0,0,0,0,0,0,180000,0,180000,0]
[null,"207.13143.1","Mariano Comense_STAZIONI DI SOLLEVAMENTO - manutenzione straordinaria (LOTTO 1) - Agglomerato 1","No","C2","C2.3",4659,"",null,"Mariano Comense","NO","",2019,"-","-","-","-","-","-","-",null,null,null,null,null,null,null,null,0,0,0,0,0,0,20017.5,0,20017.5,0]
[null,"109.13144.1","nuova linea di carico serbatoio Fico","No","B7","B7.1",0,"",null,"Maslianico","NO","Studio di fattibilità",2019,"-","-","-","-","-","-","-",null,null,null,null,null,null,null,null,0,0,0,0,0,0,325800,0,325800,0]
[null,"403.13147.1","Merone_DEPURATORE ESISTENTE - manutenzione straordinaria complessiva (LOTTO 1)","No","D2","D2.9",0,"",null,"Merone","NO","",2019,"-","-","-","-","-","100% giudizi Conformi / Regolamentari","-",null,null,null,null,null,null,null,null,0,0,0,0,0,0,450000,0,450000,0]
[null,"202.13147.1","Merone_RETI FOGNARIE - manutenzione straordinaria (LOTTO 1)","No","C2","C2.1",0,"",null,"Merone","NO","",2019,"-","-","-","-","-","-","-",null,null,null,null,null,null,null,null,0,0,0,0,0,0,36811.01,0,36811.01,0]
[null,"204.13147.1","Merone_RETI FOGNARIE - Separazione reti miste - nuove opere (LOTTO 1)","No","C4","C4.1",0,"",null,"Merone","NO","",2019,"-","-","-","-","-","massimo 1 episodio ogni 2 km di rete fognaria presenti nel Comune","-",null,null,null,null,null,null,null,null,0,0,0,0,0,0,42438.17,0,42438.17,0]
[null,"205.13147.1","Merone_SCARICATORI DI PIENA - manutenzione straordinaria (LOTTO 1)","No","C4","C4.2",216510,"",null,"Merone","NO","",2019,"-","-","-","-","-","1 episodio/anno per scolmatore","-",null,null,null,null,null,null,null,null,0,0,0,0,0,0,3925,0,3925,0]
[null,"403.13152.1","sistemazione sgrigliatore, fornitura e posa nuove soffianti, recupero volumi per stoccaggio fanghi, sistemazione area esterna","No","D2","D2.9",0,"",null,"Moltrasio","NO","",2019,"-","-","-","-","-","100% giudizi Conformi / Regolamentari","-",null,null,null,null,null,null,null,null,0,0,0,0,0,0,100000,0,100000,0]
[null,"202.13152.1","NUOVA LINEA ACQUE NERE – PIAZZA SAN ROCCO/DEPURATORE COMUNALE","No","C2","C2.1",0,"",null,"Moltrasio","NO","",2019,"-","-","-","-","-","-","-",null,null,null,null,null,null,null,null,0,0,0,0,0,0,250000,0,250000,0]
[null,"110.13153.2","SOSTITUZIONE TRATTI DI TUBAZIONE ACQUEDOTTO COMUNALE","Sì","B4","B4.1",10044,"",null,"Monguzzo","NO","",2019,"-","-","-","-","-","-","-",null,null,null,null,null,null,null,null,0,0,0,0,0,0,35325,0,35325,0]
[null,"207.13154.1","Montano Lucino_STAZIONI DI SOLLEVAMENTO - manutenzione straordinaria (LOTTO 1) - Agglomerato 2","No","C2","C2.3",4659,"",null,"Montano Lucino","NO","",2019,"-","-","-","-","-","-","-",null,null,null,null,null,null,null,null,0,0,0,0,0,0,10017.5,0,10017.5,0]
[null,"202.13155.1","Montemezzo_RETI FOGNARIE - manutenzione straordinaria (LOTTO 1)","No","C2","C2.1",0,"",null,"Montemezzo","NO","",2019,"-","-","-","-","-","-","-",null,null,null,null,null,null,null,null,0,0,0,0,0,0,925.99,0,925.99,0]
[null,"204.13157.1","Rifacimento/adeguamento separazione fognatura via Alzate e via Brianza","No","C4","C4.1",0,"",null,"Montorfano","NO","Studio di fattibilità",2019,"-","-","-","-","-","massimo 1 episodio ogni 2 km di rete fognaria presenti nel Comune","-",null,null,null,null,null,null,null,null,0,0,0,0,0,0,400000,0,400000,0]
[null,"110.13159.1","Rifacimento rete Via Matteotti","No","B4","B4.1",10044,"",null,"Mozzate","NO","",2019,"-","-","-","-","-","-","-",null,null,null,null,null,null,null,null,0,0,0,0,0,0,62000,0,62000,0]
[null,"202.13159.2","VIA VERDI E VIA MONCORNO': REALIZZAZIONE EPOTENZIAMENTO RETE MISTA","Sì","C2","C2.1",0,"",null,"Mozzate","NO","Studio di fattibilità",2019,"-","-","-","-","-","-","-",null,null,null,null,null,null,null,null,0,0,0,0,0,0,145000,0,145000,0]
[null,"204.13159.1","VIA TRIESTE/VIA MONCORNO': REALIZZAZIONE E POTENZIAMENTO RETE MISTA","No","C4","C4.1",0,"",null,"Mozzate","NO","Studio di fattibilità",2019,"-","-","-","-","-","massimo 1 episodio ogni 2 km di rete fognaria presenti nel Comune","-",null,null,null,null,null,null,null,null,0,0,0,0,0,0,390000,0,390000,0]
[null,"101.13161.1","Opere di manutenzione straordinaria ed integrazione alla rete principale dell'acquedotto sul territorio comunale","No","A1","A1.4",633,"",null,"Nesso","NO","",2019,"-","-","-","-","-","-","-",null,null,null,null,null,null,null,null,0,0,0,0,0,0,181000,0,181000,0]
[null,"110.13163.3","Sostituzione tratto rete acquedotto di via Mariano","Sì","B4","B4.1",10044,"",null,"NOVEDRATE","NO","",2019,"-","-","-","-","-","-","-",null,null,null,null,null,null,null,null,0,0,0,0,0,0,39250,0,39250,0]
[null,"204.13163.1","Novedrate_RETI FOGNARIE - Separazione reti miste - nuove opere (LOTTO 1)","No","C4","C4.1",0,"",null,"Novedrate","NO","",2019,"-","-","-","-","-","massimo 1 episodio ogni 2 km di rete fognaria presenti nel Comune","-",null,null,null,null,null,null,null,null,0,0,0,0,0,0,23649.01,0,23649.01,0]
[null,"302.13165.5","Lavori di rifacimento condotte zona Nord in comune di Olgiate Comasco – Lotto C Stralcio 2 (Via Bizzarone e zona Forno inceneritore)","No","C2","C2.1",0,"",null,"Olgiate Comasco","NO","Progetto definitivo",2019,"-","-","-","-","-","-","-",null,null,null,null,null,null,null,null,0,0,0,0,0,0,1800000,0,1800000,0]
[null,"205.13165.1","Olgiate Comasco_SCARICATORI DI PIENA - manutenzione straordinaria (LOTTO 1) - Agglomerato 1","No","C4","C4.2",216510,"",null,"Olgiate Comasco","NO","",2019,"-","-","-","-","-","1 episodio/anno per scolmatore","-",null,null,null,null,null,null,null,null,0,0,0,0,0,0,45137.5,0,45137.5,0]
[null,"206.13165.1","Olgiate Comasco_SCARICATORI DI PIENA - nuove opere (inserimento / adeguamento paratoie) (LOTTO 1) - Agglomerato 1","No","C4","C4.2",11407,"",null,"Olgiate Comasco","NO","",2019,"-","-","-","-","-","1 episodio/anno per scolmatore","-",null,null,null,null,null,null,null,null,0,0,0,0,0,0,14570.5,0,14570.5,0]
[null,"207.13165.1","Olgiate Comasco_STAZIONI DI SOLLEVAMENTO - manutenzione straordinaria (LOTTO 1) - Agglomerato 1","No","C2","C2.3",4659,"",null,"Olgiate Comasco","NO","",2019,"-","-","-","-","-","-","-",null,null,null,null,null,null,null,null,0,0,0,0,0,0,4003.5,0,4003.5,0]
[null,"207.13165.2","Olgiate Comasco_STAZIONI DI SOLLEVAMENTO - manutenzione straordinaria (LOTTO 1) - Agglomerato 2","No","C2","C2.3",4659,"",null,"Olgiate Comasco","NO","",2019,"-","-","-","-","-","-","-",null,null,null,null,null,null,null,null,0,0,0,0,0,0,4003.5,0,4003.5,0]
[null,"111.13169.1","Adeguamento centrale via Ferrario","No","B8","B8.1",0,"",null,"Oltrona San Mamette","NO","Studio di fattibilità",2019,"-","-","-","-","-","-","-",null,null,null,null,null,null,null,null,0,0,0,0,0,0,72400,0,72400,0]
[null,"202.13169.1","Oltrona San Mamette_RETI FOGNARIE - manutenzione straordinaria (LOTTO 1)","No","C2","C2.1",0,"",null,"Oltrona San Mamette","NO","",2019,"-","-","-","-","-","-","-",null,null,null,null,null,null,null,null,0,0,0,0,0,0,7893.96,0,7893.96,0]
[null,"207.13169.1","Oltrona San Mamette_STAZIONI DI SOLLEVAMENTO - manutenzione straordinaria (LOTTO 1)","No","C2","C2.3",4659,"",null,"Oltrona San Mamette","NO","",2019,"-","-","-","-","-","-","-",null,null,null,null,null,null,null,null,0,0,0,0,0,0,4003.5,0,4003.5,0]
[null,"101.13170.2","ZONA TUTELA ASSOLUTA POZZO BOSCO FOPPA ORSENIGO","No","A1","A1.4",633,"",null,"Orsenigo","NO","",2019,"-","-","-","-","-","-","-",null,null,null,null,null,null,null,null,0,0,0,0,0,0,15000,0,15000,0]
[null,"110.13170.4","RETE IDRICA VIA IX AGOSTO","No","B4","B4.1",10044,"",null,"ORSENIGO","NO","Studio di fattibilità",2019,"-","-","-","-","-","-","-",null,null,null,null,null,null,null,null,0,0,0,0,0,0,25000,0,25000,0]
[null,"110.13170.5","RETE IDRICA PARZANO","No","B4","B4.1",10044,"",null,"ORSENIGO","NO","Studio di fattibilità",2019,"-","-","-","-","-","-","-",null,null,null,null,null,null,null,null,0,0,0,0,0,0,25000,0,25000,0]
[null,"204.13170.2","Orsenigo_RETI FOGNARIE - Separazione reti miste - nuove opere (LOTTO 1) - Agglomerato 2","No","C4","C4.1",0,"",null,"Orsenigo","NO","",2019,"-","-","-","-","-","massimo 1 episodio ogni 2 km di rete fognaria presenti nel Comune","-",null,null,null,null,null,null,null,null,0,0,0,0,0,0,8748.92,0,8748.92,0]
[null,"205.13170.1","Opere di adeguamento scolmatore rete acque miste Via Enrico Fermi","No","C4","C4.2",216510,"",null,"Orsenigo","NO","Studio di fattibilità",2019,"-","-","-","-","-","1 episodio/anno per scolmatore","-",null,null,null,null,null,null,null,null,0,0,0,0,0,0,20000,0,{"$f":"SUM(AC1448+AE1448+AG1448+AI1448)","v":20000},0]
[null,"202.13178.1","Peglio_RETI FOGNARIE - manutenzione straordinaria (LOTTO 1)","No","C2","C2.1",0,"",null,"Peglio","NO","",2019,"-","-","-","-","-","-","-",null,null,null,null,null,null,null,null,0,0,0,0,0,0,282.36,0,282.36,0]
[null,"403.13179.1","Pellio Intelvi_DEPURATORE ESISTENTE - manutenzione straordinaria complessiva (LOTTO 1)","No","D2","D2.9",0,"",null,"Pellio Intelvi","NO","",2019,"-","-","-","-","-","100% giudizi Conformi / Regolamentari","-",null,null,null,null,null,null,null,null,0,0,0,0,0,0,6280,0,6280,0]
[null,"110.13183.1","Interventi di adeguamento delle reti distributrici e manutenzione straordinaria delle captazioni montane","No","B4","B4.1",10044,"",null,"Pianello del Lario","NO","Studio di fattibilità",2019,"-","-","-","-","-","-","-",null,null,null,null,null,null,null,null,0,0,0,0,0,0,157000,0,157000,0]
[null,"110.13184.1","Reti - Intervento 1","No","B4","B4.1",10044,"",null,"Pigra","NO","",2019,"-","-","-","-","-","-","-",null,null,null,null,null,null,null,null,0,0,0,0,0,0,117750,0,117750,0]
[null,"111.13186.1","Interventi di manutenzione straordinaria al serbatoio e adeguamento funzionale degli impianti di pompaggio e potabilizzazione","Sì","B8","B8.1",0,"",null,"Pognana Lario","NO","Studio di fattibilità",2019,"-","-","-","-","-","-","-",null,null,null,null,null,null,null,null,0,0,0,0,0,0,72400,0,72400,0]
[null,"403.13187.1","Ponna_DEPURATORE ESISTENTE - manutenzione straordinaria complessiva (LOTTO 1)","No","D2","D2.9",0,"",null,"Ponna","NO","",2019,"-","-","-","-","-","100% giudizi Conformi / Regolamentari","-",null,null,null,null,null,null,null,null,0,0,0,0,0,0,5000,0,5000,0]
[null,"202.13187.1","Ponna_RETI FOGNARIE - manutenzione straordinaria (LOTTO 1)","No","C2","C2.1",0,"",null,"Ponna","NO","",2019,"-","-","-","-","-","-","-",null,null,null,null,null,null,null,null,0,0,0,0,0,0,973.56,0,973.56,0]
[null,"302.13188.1","Spostamento collettore consortile in Comune di Ponte Lambro","No","C2","C2.1",0,"",null,"Ponte Lambro","NO","Progetto preliminare",2019,"-","-","-","-","-","-","-",null,null,null,null,null,null,null,null,0,0,0,0,0,0,243485,0,243485,0]
[null,"204.13188.1","Ponte Lambro_RETI FOGNARIE - Separazione reti miste - nuove opere (LOTTO 1)","No","C4","C4.1",0,"",null,"Ponte Lambro","NO","",2019,"-","-","-","-","-","massimo 1 episodio ogni 2 km di rete fognaria presenti nel Comune","-",null,null,null,null,null,null,null,null,0,0,0,0,0,0,18342.54,0,18342.54,0]
[null,"207.13188.1","Ponte Lambro_STAZIONI DI SOLLEVAMENTO - manutenzione straordinaria (LOTTO 1)","No","C2","C2.3",4659,"",null,"Ponte Lambro","NO","",2019,"-","-","-","-","-","-","-",null,null,null,null,null,null,null,null,0,0,0,0,0,0,8007,0,8007,0]
[null,"108.13189.1","Porlezza - Nuovo Telecontrollo","No","K3","K3.1",0,"",null,"Porlezza","NO","Progetto preliminare",2019,"-","-","-","-","-","-","-",null,null,null,null,null,null,null,null,0,0,0,0,0,0,60000,0,60000,0]
[null,"403.13189.1","Porlezza_DEPURATORE ESISTENTE - manutenzione straordinaria complessiva (LOTTO 1)","No","D2","D2.9",0,"",null,"Porlezza","NO","",2019,"-","-","-","-","-","100% giudizi Conformi / Regolamentari","-",null,null,null,null,null,null,null,null,0,0,0,0,0,0,138728.75,0,138728.75,0]
[null,"406.13189.1","Porlezza_DEPURATORE ESISTENTE - Telecontrollo","No","K3","K3.1",0,"",null,"Porlezza","N.A.","",2019,"-","-","-","-","-","-","-",null,null,null,null,null,null,null,null,0,0,0,0,0,0,40000,0,40000,0]
[null,"204.13193.1","Pusiano_RETI FOGNARIE - Separazione reti miste - nuove opere (LOTTO 1)","No","C4","C4.1",0,"",null,"Pusiano","NO","",2019,"-","-","-","-","-","massimo 1 episodio ogni 2 km di rete fognaria presenti nel Comune","-",null,null,null,null,null,null,null,null,0,0,0,0,0,0,8169.44,0,8169.44,0]
[null,"403.13194.1","Ramponio Verna_DEPURATORE ESISTENTE - manutenzione straordinaria complessiva (LOTTO 1)","No","D2","D2.9",0,"",null,"Ramponio Verna","NO","",2019,"-","-","-","-","-","100% giudizi Conformi / Regolamentari","-",null,null,null,null,null,null,null,null,0,0,0,0,0,0,6280,0,6280,0]
[null,"205.13197.1","Rodero_SCARICATORI DI PIENA - manutenzione straordinaria (LOTTO 1)","No","C4","C4.2",216510,"",null,"Rodero","NO","",2019,"-","-","-","-","-","1 episodio/anno per scolmatore","-",null,null,null,null,null,null,null,null,0,0,0,0,0,0,1962.5,0,1962.5,0]
[null,"109.13199.1","REALIZZAZIONE NUOVA LINEA DI DISTRIBUZIONE DI ALIMENTAZIONE \"CASCINA ARZIA\"","No","B7","B7.1",0,"",null,"Ronago","NO","Studio di fattibilità",2019,"-","-","-","-","-","-","-",null,null,null,null,null,null,null,null,0,0,0,0,0,0,22625,0,22625,0]
[null,"402.13199.2","RIFACIMENTO COPERTURA DEI LOCALI UFFICI","Sì","D2","D2.2",0,"",null,"RONAGO","NO","Studio di fattibilità",2019,"-","-","-","-","-","-","-",null,null,null,null,null,null,null,null,0,0,0,0,0,0,7000,0,7000,0]
[null,"403.13199.1","FORNITURA E INSTALLAZIONE GRUPPO DI CONTINUITA'","Sì","D2","D2.9",0,"",null,"RONAGO","NO","Studio di fattibilità",2019,"-","-","-","-","-","100% giudizi Conformi / Regolamentari","-",null,null,null,null,null,null,null,null,0,0,0,0,0,0,150000,0,150000,0]
[null,"406.13199.1","ADEGUAMENTO IMPIANTO TELECONTROLLO","Sì","K3","K3.1",0,"",null,"RONAGO","N.A.","Studio di fattibilità",2019,"-","-","-","-","-","-","-",null,null,null,null,null,null,null,null,0,0,0,0,0,0,8000,0,8000,0]
[null,"202.13201.2","Sistemazione centro storico - Intervento 1","No","C2","C2.1",0,"",null,"Rovellasca","NO","Studio di fattibilità",2019,"-","-","-","-","-","-","-",null,null,null,null,null,null,null,null,0,0,0,0,0,0,235596.88,0,235596.88,0]
[null,"202.13201.3","Sostituzione o risanamento strutturale delle tubazioni in fascia di rispetto del pozzo via Scuole/S. Francesco - Intervento 1","Sì","C2","C2.1",0,"",null,"Rovellasca","NO","Studio di fattibilità",2019,"-","-","-","-","-","-","-",null,null,null,null,null,null,null,null,0,0,0,0,0,0,135225,0,135225,0]
[null,"110.13202.1","Rovello Porro_RETE DI DISTRIBUZIONE - manutenzione straordinaria / rifacimenti (LOTTO 1)","Sì","B4","B4.1",10044,"",null,"Rovello Porro","NO","",2019,"-","-","-","-","-","-","-",null,null,null,null,null,null,null,null,0,0,0,0,0,0,36738,0,36738,0]
[null,"202.13202.2","Sostituzione o risanamento strutturale delle tubazioni in fascia di rispetto del pozzo via Carcano - Intervento 1","Sì","C2","C2.1",0,"",null,"Rovello Porro","NO","Studio di fattibilità",2019,"-","-","-","-","-","-","-",null,null,null,null,null,null,null,null,0,0,0,0,0,0,253762.5,0,253762.5,0]
[null,"100.13204.1","Allacciamenti alla rete acquedottistica","No","-","-",0,"",null,"San Bartolomeo Val Cavargna","NO","",2019,"-","-","-","-","-","-","-",null,null,null,null,null,null,null,null,0,0,0,0,0,0,0,131200,0,131200]
[null,"403.13204.1","S. Bartolomeo Val Cavargna - Vora_DEPURATORE ESISTENTE - manutenzione straordinaria complessiva (LOTTO 1)","No","D2","D2.9",0,"",null,"San Bartolomeo Val Cavargna","NO","",2019,"-","-","-","-","-","100% giudizi Conformi / Regolamentari","-",null,null,null,null,null,null,null,null,0,0,0,0,0,0,4647.2,0,4647.2,0]
[null,"200.13204.1","Allacciamenti alla rete fognaria","No","-","-",0,"",null,"San Bartolomeo Val Cavargna","NO","",2019,"-","-","-","-","-","-","-",null,null,null,null,null,null,null,null,0,0,0,0,0,0,0,113280,0,113280]
[null,"201.13204.1","San Bartolomeo Val Cavargna_RETI FOGNARIE - Estensione - nuove opere","No","C1","C1.1",0,204,"rilevata","San Bartolomeo Val Cavargna","NO","",2019,"-","-","-","-","-","-","-",null,null,null,null,null,null,null,null,0,0,0,0,0,0,308261.09999999998,0,308261.09999999998,0]
[null,"202.13204.1","San Bartolomeo Val Cavargna_RETI FOGNARIE - manutenzione straordinaria (LOTTO 1)","No","C2","C2.1",0,"",null,"San Bartolomeo Val Cavargna","NO","",2019,"-","-","-","-","-","-","-",null,null,null,null,null,null,null,null,0,0,0,0,0,0,1336.93,0,1336.93,0]
[null,"110.13206.2","San Fermo della Battaglia_RETE DI DISTRIBUZIONE - manutenzione straordinaria / rifacimenti (LOTTO 1)","No","B4","B4.1",10044,"",null,"San Fermo della Battaglia","NO","",2019,"-","-","-","-","-","-","-",null,null,null,null,null,null,null,null,0,0,0,0,0,0,4500.92,0,4500.92,0]
[null,"205.13206.1","San Fermo della Battaglia_SCARICATORI DI PIENA - manutenzione straordinaria (LOTTO 1)","No","C4","C4.2",216510,"",null,"San Fermo della Battaglia","NO","",2019,"-","-","-","-","-","1 episodio/anno per scolmatore","-",null,null,null,null,null,null,null,null,0,0,0,0,0,0,9812.5,0,9812.5,0]
[null,"100.13207.1","Allacciamenti alla rete acquedottistica","No","-","-",0,"",null,"San Nazzaro Val Cavargna","NO","",2019,"-","-","-","-","-","-","-",null,null,null,null,null,null,null,null,0,0,0,0,0,0,0,100800,0,100800]
[null,"110.13207.1","Adeguamento e potenziamento rete idrica comunale presso centro storico","No","B4","B4.1",10044,"",null,"San Nazzaro Val Cavargna","NO","Studio di fattibilità",2019,"-","-","-","-","-","-","-",null,null,null,null,null,null,null,null,0,0,0,0,0,0,62800,0,62800,0]
[null,"200.13207.1","Allacciamenti alla rete fognaria","No","-","-",0,"",null,"San Nazzaro Val Cavargna","NO","",2019,"-","-","-","-","-","-","-",null,null,null,null,null,null,null,null,0,0,0,0,0,0,0,110023.2,0,110023.2]
[null,"200.13207.1","Allacciamenti alla rete fognaria","No","-","-",0,"",null,"San Nazzaro Val Cavargna","NO","",2019,"-","-","-","-","-","-","-",null,null,null,null,null,null,null,null,0,0,0,0,0,0,0,38656.800000000003,0,38656.800000000003]
[null,"201.13207.1","San Nazzaro Val Cavargna_RETI FOGNARIE - Estensione - nuove opere - Agglomerato 1","No","C1","C1.1",0,"",null,"San Nazzaro Val Cavargna","NO","",2019,"-","-","-","-","-","-","-",null,null,null,null,null,null,null,null,0,0,0,0,0,0,223010.1,0,223010.1,0]
[null,"201.13207.2","San Nazzaro Val Cavargna_RETI FOGNARIE - Estensione - nuove opere - Agglomerato 2","No","C1","C1.1",0,"",null,"San Nazzaro Val Cavargna","NO","",2019,"-","-","-","-","-","-","-",null,null,null,null,null,null,null,null,0,0,0,0,0,0,78354.899999999994,0,78354.899999999994,0]
[null,"202.13207.1","San Nazzaro Val Cavargna_RETI FOGNARIE - manutenzione straordinaria (LOTTO 1) - Agglomerato 1","No","C2","C2.1",0,"",null,"San Nazzaro Val Cavargna","NO","",2019,"-","-","-","-","-","-","-",null,null,null,null,null,null,null,null,0,0,0,0,0,0,422.36,0,422.36,0]
[null,"202.13207.2","San Nazzaro Val Cavargna_RETI FOGNARIE - manutenzione straordinaria (LOTTO 1) - Agglomerato 2","No","C2","C2.1",0,"",null,"San Nazzaro Val Cavargna","NO","",2019,"-","-","-","-","-","-","-",null,null,null,null,null,null,null,null,0,0,0,0,0,0,361.38,0,361.38,0]
[null,"101.13248.1","REALIZZAZIONE DI RECINZIONE OPERE DI CAPTAZIONE","No","A1","A1.4",633,"",null,"San Siro","NO","Studio di fattibilità",2019,"-","-","-","-","-","-","-",null,null,null,null,null,null,null,null,0,0,0,0,0,0,40000,0,40000,0]
[null,"403.13248.2","San Siro - Treccione_DEPURATORE ESISTENTE - manutenzione straordinaria complessiva (LOTTO 1)","No","D2","D2.9",0,"",null,"San Siro","NO","",2019,"-","-","-","-","-","100% giudizi Conformi / Regolamentari","-",null,null,null,null,null,null,null,null,0,0,0,0,0,0,2512,0,2512,0]
[null,"110.13211.1","Schignano_RETE DI DISTRIBUZIONE - manutenzione straordinaria / rifacimenti (LOTTO 1)","No","B4","B4.1",10044,"",null,"Schignano","NO","",2019,"-","-","-","-","-","-","-",null,null,null,null,null,null,null,null,0,0,0,0,0,0,14108.1,0,14108.1,0]
[null,"207.13212.1","Senna Comasco_STAZIONI DI SOLLEVAMENTO - manutenzione straordinaria (LOTTO 1)","No","C2","C2.3",4659,"",null,"Senna Comasco","NO","",2019,"-","-","-","-","-","-","-",null,null,null,null,null,null,null,null,0,0,0,0,0,0,12010.5,0,12010.5,0]
[null,"202.13215.3","Solbiate_RETI FOGNARIE - manutenzione straordinaria (LOTTO 1) - Agglomerato 3","No","C2","C2.1",0,"",null,"Solbiate","NO","",2019,"-","-","-","-","-","-","-",null,null,null,null,null,null,null,null,0,0,0,0,0,0,4978.3500000000004,0,4978.3500000000004,0]
[null,"204.13215.2","Solbiate_RETI FOGNARIE - Separazione reti miste - nuove opere (LOTTO 1) - Agglomerato 3","No","C4","C4.1",0,"",null,"Solbiate","NO","",2019,"-","-","-","-","-","massimo 1 episodio ogni 2 km di rete fognaria presenti nel Comune","-",null,null,null,null,null,null,null,null,0,0,0,0,0,0,5739.37,0,5739.37,0]
[null,"205.13215.1","Solbiate_SCARICATORI DI PIENA - manutenzione straordinaria (LOTTO 1) - Agglomerato 1","No","C4","C4.2",216510,"",null,"Solbiate","NO","",2019,"-","-","-","-","-","1 episodio/anno per scolmatore","-",null,null,null,null,null,null,null,null,0,0,0,0,0,0,3925,0,3925,0]
[null,"205.13215.2","Solbiate_SCARICATORI DI PIENA - manutenzione straordinaria (LOTTO 1) - Agglomerato 2","No","C4","C4.2",216510,"",null,"Solbiate","NO","",2019,"-","-","-","-","-","1 episodio/anno per scolmatore","-",null,null,null,null,null,null,null,null,0,0,0,0,0,0,1962.5,0,1962.5,0]
[null,"205.13215.3","Solbiate_SCARICATORI DI PIENA - manutenzione straordinaria (LOTTO 1) - Agglomerato 3","No","C4","C4.2",216510,"",null,"Solbiate","NO","",2019,"-","-","-","-","-","1 episodio/anno per scolmatore","-",null,null,null,null,null,null,null,null,0,0,0,0,0,0,1962.5,0,1962.5,0]
[null,"206.13215.1","Solbiate_SCARICATORI DI PIENA - nuove opere (inserimento / adeguamento paratoie) (LOTTO 1) - Agglomerato 1","No","C4","C4.2",11407,"",null,"Solbiate","NO","",2019,"-","-","-","-","-","1 episodio/anno per scolmatore","-",null,null,null,null,null,null,null,null,0,0,0,0,0,0,1267,0,1267,0]
[null,"206.13215.2","Solbiate_SCARICATORI DI PIENA - nuove opere (inserimento / adeguamento paratoie) (LOTTO 1) - Agglomerato 2","No","C4","C4.2",11407,"",null,"Solbiate","NO","",2019,"-","-","-","-","-","1 episodio/anno per scolmatore","-",null,null,null,null,null,null,null,null,0,0,0,0,0,0,633.5,0,633.5,0]
[null,"206.13215.3","Solbiate_SCARICATORI DI PIENA - nuove opere (inserimento / adeguamento paratoie) (LOTTO 1) - Agglomerato 3","No","C4","C4.2",11407,"",null,"Solbiate","NO","",2019,"-","-","-","-","-","1 episodio/anno per scolmatore","-",null,null,null,null,null,null,null,null,0,0,0,0,0,0,633.5,0,633.5,0]
[null,"403.13216.1","Sorico - Nigolo_DEPURATORE ESISTENTE - manutenzione straordinaria complessiva (LOTTO 1)","No","D2","D2.9",0,"",null,"Sorico","NO","",2019,"-","-","-","-","-","100% giudizi Conformi / Regolamentari","-",null,null,null,null,null,null,null,null,0,0,0,0,0,0,2009.6,0,2009.6,0]
[null,"201.13216.2","Fognatura Locofontana","No","C1","C1.1",0,"",null,"Sorico","NO","Studio di fattibilità",2019,"-","-","-","-","-","-","-",null,null,null,null,null,null,null,null,0,0,0,0,0,0,100000,0,100000,0]
[null,"204.13217.1","Sormano_RETI FOGNARIE - Separazione reti miste - nuove opere (LOTTO 1)","No","C4","C4.1",0,"",null,"Sormano","NO","",2019,"-","-","-","-","-","massimo 1 episodio ogni 2 km di rete fognaria presenti nel Comune","-",null,null,null,null,null,null,null,null,0,0,0,0,0,0,7325.07,0,7325.07,0]
[null,"205.13217.1","Sormano_SCARICATORI DI PIENA - manutenzione straordinaria","No","C4","C4.2",216510,"",null,"Sormano","NO","",2019,"-","-","-","-","-","1 episodio/anno per scolmatore","-",null,null,null,null,null,null,null,null,0,0,0,0,0,0,7850,0,7850,0]
[null,"206.13217.1","Sormano_SCARICATORI DI PIENA - nuove opere (inserimento / adeguamento paratoie)","No","C4","C4.2",11407,"",null,"Sormano","NO","",2019,"-","-","-","-","-","1 episodio/anno per scolmatore","-",null,null,null,null,null,null,null,null,0,0,0,0,0,0,2534,0,2534,0]
[null,"110.13218.1","Stazzona_RETE DI DISTRIBUZIONE - manutenzione straordinaria / rifacimenti (LOTTO 1)","No","B4","B4.1",10044,"",null,"Stazzona","NO","",2019,"-","-","-","-","-","-","-",null,null,null,null,null,null,null,null,0,0,0,0,0,0,43902.3,0,43902.3,0]
[null,"110.13222.2","Rete idrica via Chiassino","Sì","B4","B4.1",10044,"",null,"Tavernerio","NO","Progetto preliminare",2019,"-","-","-","-","-","-","-",null,null,null,null,null,null,null,null,0,0,0,0,0,0,31400,0,31400,0]
[null,"100.13223.1","Allacciamenti alla rete acquedottistica","No","-","-",0,"",null,"Torno","NO","",2019,"-","-","-","-","-","-","-",null,null,null,null,null,null,null,null,0,0,0,0,0,0,0,89600,0,89600]
[null,"110.13223.1","Torno_RETE DI DISTRIBUZIONE - manutenzione straordinaria / rifacimenti (LOTTO 1)","No","B4","B4.1",10044,"",null,"Torno","NO","",2019,"-","-","-","-","-","-","-",null,null,null,null,null,null,null,null,0,0,0,0,0,0,6194.2,0,6194.2,0]
[null,"200.13223.1","Allacciamenti alla rete fognaria","No","-","-",0,"",null,"Torno","NO","",2019,"-","-","-","-","-","-","-",null,null,null,null,null,null,null,null,0,0,0,0,0,0,0,132160,0,132160]
[null,"201.13223.1","TORNO_RETI FOGNARIE - Estensione rete in aree all'interno dell'agglomerato sprovviste del servizio","Sì","C1","C1.1",0,"",null,"Torno","NO","",2019,"-","-","-","-","-","-","-",null,null,null,null,null,null,null,null,0,0,0,0,0,0,147828.49,0,{"$f":"SUM(AC1510+AE1510+AG1510+AI1510)","v":147828.49},{"$f":"SUM(AD1510+AF1510+AH1510+AJ1510)","v":0}]
[null,"201.13223.1","Fognatura comunale 16° lotto","Sì","C1","C1.1",0,"",null,"Torno","NO","Progetto preliminare",2019,"-","-","-","-","-","-","-",null,null,null,null,null,null,null,null,0,0,0,0,0,0,135000,0,135000,0]
[null,"102.13252.2","Riqualificazione delle infrastrutture idrauliche della presa e captazione nella Valle Pola: nuovo bottino di presa, rifacimento della condotta e sistemazione idraulica-naturalistica dell'accesso alla sorgente","No","A1","A1.1",0,"",null,"Tremezzina","NO","Studio di fattibilità",2019,"-","-","-","-","-",0,"-",null,null,null,null,null,null,null,null,0,0,0,0,0,0,180000,0,180000,0]
[null,"110.13252.3","Rifacimento rete distributrice Via del Soccorso a Lenno","No","B4","B4.1",10044,"",null,"Tremezzina","NO","Studio di fattibilità",2019,"-","-","-","-","-","-","-",null,null,null,null,null,null,null,null,0,0,0,0,0,0,250000,0,250000,0]
[null,"202.13252.3","Rifacimento rete fognaria in Via Monte Crocione - Località Tremezzo/Bolvedro","Sì","C2","C2.1",0,"",null,"Tremezzina","NO","Studio di fattibilità",2019,"-","-","-","-","-","-","-",null,null,null,null,null,null,null,null,0,0,0,0,0,0,100000,0,100000,0]
[null,"207.13252.2","Rifacimento completo della carpenteria (Calate, piedi accoppiamento pome, tubazioni di mandate in vasca e collettori) (LOTTO 2)","No","C2","C2.3",4659,"",null,"Tremezzina","NO","",2019,"-","-","-","-","-","-","-",null,null,null,null,null,null,null,null,0,0,0,0,0,0,81818.179999999993,0,81818.179999999993,0]
[null,"202.13226.1","Trezzone_RETI FOGNARIE - manutenzione straordinaria (LOTTO 1)","No","C2","C2.1",0,"",null,"Trezzone","NO","",2019,"-","-","-","-","-","-","-",null,null,null,null,null,null,null,null,0,0,0,0,0,0,1452.8,0,1452.8,0]
[null,"204.13226.1","Trezzone_RETI FOGNARIE - Separazione reti miste - nuove opere (LOTTO 1)","No","C4","C4.1",0,"",null,"Trezzone","NO","",2019,"-","-","-","-","-","massimo 1 episodio ogni 2 km di rete fognaria presenti nel Comune","-",null,null,null,null,null,null,null,null,0,0,0,0,0,0,83744.179999999993,0,83744.179999999993,0]
[null,"105.13227.1","POSA FILTRO DESABBIATORE POZZO VIA ISONZO","No","P2","P2.1",0,"",null,"Turate","NO","Progetto preliminare",2019,"-","-","-","-","-","100% giudizi almeno DISCRETO","-",null,null,null,null,null,null,null,null,0,0,0,0,0,0,25000,0,25000,0]
[null,"202.13227.1","Turate_RETI FOGNARIE - manutenzione straordinaria (LOTTO 1)","No","C2","C2.1",0,"",null,"Turate","NO","",2019,"-","-","-","-","-","-","-",null,null,null,null,null,null,null,null,0,0,0,0,0,0,15398.17,0,15398.17,0]
[null,"202.13228.1","ADEGUAMENTO TRATTO DI FOGNATURA IN VIA BUONARROTI","No","C2","C2.1",0,"",null,"Uggiate Trevano","NO","Studio di fattibilità",2019,"-","-","-","-","-","-","-",null,null,null,null,null,null,null,null,0,0,0,0,0,0,380000,0,380000,0]
[null,"206.13228.1","Uggiate Trevano_SCARICATORI DI PIENA - nuove opere (inserimento / adeguamento paratoie) (LOTTO 1)","No","C4","C4.2",11407,"",null,"Uggiate Trevano","NO","",2019,"-","-","-","-","-","1 episodio/anno per scolmatore","-",null,null,null,null,null,null,null,null,0,0,0,0,0,0,6968.5,0,6968.5,0]
[null,"305.13228.1","Adeguamento centrale di rilancio in comune di Uggiate Trevano","No","C8","C8.1",210043.56,"",null,"Uggiate Trevano","NO","Studio di fattibilità",2019,"-","-","-","-","-","massimo 1 episodio ogni 2 km di rete fognaria presenti nel Comune","-",null,null,null,null,null,null,null,null,0,0,0,0,0,0,450000,0,450000,0]
[null,"403.13233.1","Val Rezzo - Buggiolo_DEPURATORE ESISTENTE - manutenzione straordinaria complessiva (LOTTO 1)","No","D2","D2.9",0,"",null,"Val Rezzo","NO","",2019,"-","-","-","-","-","100% giudizi Conformi / Regolamentari","-",null,null,null,null,null,null,null,null,0,0,0,0,0,0,5024,0,5024,0]
[null,"403.13233.1","Val Rezzo - Seghebbia_DEPURATORE ESISTENTE - manutenzione straordinaria complessiva (LOTTO 1)","No","D2","D2.9",0,"",null,"Val Rezzo","NO","",2019,"-","-","-","-","-","100% giudizi Conformi / Regolamentari","-",null,null,null,null,null,null,null,null,0,0,0,0,0,0,2512,0,2512,0]
[null,"207.13229.1","Valbrona_STAZIONI DI SOLLEVAMENTO - manutenzione straordinaria (LOTTO 1)","No","C2","C2.3",4659,"",null,"Valbrona","NO","",2019,"-","-","-","-","-","-","-",null,null,null,null,null,null,null,null,0,0,0,0,0,0,4003.5,0,4003.5,0]
[null,"110.13234.1","Opere di urbanizzazione fraz. Puria","Sì","B4","B4.1",10044,"",null,"Valsolda","N.A.","Progetto esecutivo",2019,"-","-","-","-","-","-","-",null,null,null,null,null,null,null,null,0,0,0,0,0,0,0,54950,0,54950]
[null,"202.13234.1","Rifacimento fognatura fraz. Puria","No","C2","C2.1",0,"",null,"Valsolda","NO","Progetto preliminare",2019,"-","-","-","-","-","-","-",null,null,null,null,null,null,null,null,0,0,0,0,0,0,225000,0,225000,0]
[null,"403.13236.2","Realizzazione dissabbiatura","No","D2","D2.9",0,"",null,"Veleso","NO","Progetto preliminare",2019,"-","-","-","-","-","100% giudizi Conformi / Regolamentari","-",null,null,null,null,null,null,null,null,0,0,0,0,0,0,40000,0,40000,0]
[null,"202.13236.1","Veleso_RETI FOGNARIE - manutenzione straordinaria (LOTTO 1)","No","C2","C2.1",0,"",null,"Veleso","NO","",2019,"-","-","-","-","-","-","-",null,null,null,null,null,null,null,null,0,0,0,0,0,0,1213.77,0,1213.77,0]
[null,"111.13238.2","Adeguamento serbatoi via Aldo Moro","No","B8","B8.1",0,"",null,"Veniano","NO","Studio di fattibilità",2019,"-","-","-","-","-","-","-",null,null,null,null,null,null,null,null,0,0,0,0,0,0,117650,0,117650,0]
[null,"202.13238.1","Veniano_RETI FOGNARIE - manutenzione straordinaria (LOTTO 1)","No","C2","C2.1",0,"",null,"Veniano","NO","",2019,"-","-","-","-","-","-","-",null,null,null,null,null,null,null,null,0,0,0,0,0,0,15581.86,0,15581.86,0]
[null,"205.13238.1","Veniano_SCARICATORI DI PIENA - manutenzione straordinaria","No","C4","C4.2",216510,"",null,"Veniano","NO","",2019,"-","-","-","-","-","1 episodio/anno per scolmatore","-",null,null,null,null,null,null,null,null,0,0,0,0,0,0,5887.5,0,5887.5,0]
[null,"206.13238.1","Veniano_SCARICATORI DI PIENA - nuove opere (inserimento / adeguamento paratoie) (prioritario con attivazione immediata)","No","C4","C4.2",11407,"",null,"Veniano","NO","",2019,"-","-","-","-","-","1 episodio/anno per scolmatore","-",null,null,null,null,null,null,null,null,0,0,0,0,0,0,1900.5,0,1900.5,0]
[null,"202.13239.1","Vercana_RETI FOGNARIE - manutenzione straordinaria (LOTTO 1)","No","C2","C2.1",0,"",null,"Vercana","NO","",2019,"-","-","-","-","-","-","-",null,null,null,null,null,null,null,null,0,0,0,0,0,0,1222.72,0,1222.72,0]
[null,"110.13242.1","Rifacimento rete  acquedotto in Via Statale dei Giovi da via Per Bregnano  al confine con il territorio del Comune di Cermenate","No","B4","B4.1",10044,"",null,"Vertemate con Minoprio","NO","Studio di fattibilità",2019,"-","-","-","-","-","-","-",null,null,null,null,null,null,null,null,0,0,0,0,0,0,235500,0,235500,0]
[null,"207.13242.1","Vertemate con Minoprio_STAZIONI DI SOLLEVAMENTO - manutenzione straordinaria (LOTTO 1)","No","C2","C2.3",4659,"",null,"Vertemate con Minoprio","NO","",2019,"-","-","-","-","-","-","-",null,null,null,null,null,null,null,null,0,0,0,0,0,0,4003.5,0,4003.5,0]
[null,"110.13245.2","Rifacimento rete acquedotto via Mazzini e via IV Novembre","No","B4","B4.1",10044,"",null,"Villa Guardia","NO","Studio di fattibilità",2019,"-","-","-","-","-","-","-",null,null,null,null,null,null,null,null,0,0,0,0,0,0,94200,0,94200,0]
[null,"204.13245.1","Villa Guardia_RETI FOGNARIE - Separazione reti miste - nuove opere (LOTTO 1) - Agglomerato 1","No","C4","C4.1",0,"",null,"Villa Guardia","NO","",2019,"-","-","-","-","-","massimo 1 episodio ogni 2 km di rete fognaria presenti nel Comune","-",null,null,null,null,null,null,null,null,0,0,0,0,0,0,12583.14,0,12583.14,0]
[null,"204.13245.2","Villa Guardia_RETI FOGNARIE - Separazione reti miste - nuove opere (LOTTO 1) - Agglomerato 2","No","C4","C4.1",0,"",null,"Villa Guardia","NO","",2019,"-","-","-","-","-","massimo 1 episodio ogni 2 km di rete fognaria presenti nel Comune","-",null,null,null,null,null,null,null,null,0,0,0,0,0,0,14453.21,0,14453.21,0]
[null,"204.13245.3","Villa Guardia_RETI FOGNARIE - Separazione reti miste - nuove opere (LOTTO 1) - Agglomerato 3","No","C4","C4.1",0,"",null,"Villa Guardia","NO","",2019,"-","-","-","-","-","massimo 1 episodio ogni 2 km di rete fognaria presenti nel Comune","-",null,null,null,null,null,null,null,null,0,0,0,0,0,0,5486.63,0,5486.63,0]
[null,"205.13245.1","Villa Guardia_SCARICATORI DI PIENA - manutenzione straordinaria (LOTTO 1) - Agglomerato 1","No","C4","C4.2",216510,"",null,"Villa Guardia","NO","",2019,"-","-","-","-","-","1 episodio/anno per scolmatore","-",null,null,null,null,null,null,null,null,0,0,0,0,0,0,9812.5,0,9812.5,0]
[null,"205.13245.2","Villa Guardia_SCARICATORI DI PIENA - manutenzione straordinaria (LOTTO 1) - Agglomerato 2","No","C4","C4.2",216510,"",null,"Villa Guardia","NO","",2019,"-","-","-","-","-","1 episodio/anno per scolmatore","-",null,null,null,null,null,null,null,null,0,0,0,0,0,0,7850,0,7850,0]
[null,"205.13245.3","Villa Guardia_SCARICATORI DI PIENA - manutenzione straordinaria (LOTTO 1) - Agglomerato 3","No","C4","C4.2",216510,"",null,"Villa Guardia","NO","",2019,"-","-","-","-","-","1 episodio/anno per scolmatore","-",null,null,null,null,null,null,null,null,0,0,0,0,0,0,5887.5,0,5887.5,0]
[null,"206.13245.1","Villa Guardia_SCARICATORI DI PIENA - nuove opere (inserimento / adeguamento paratoie) (LOTTO 1) - Agglomerato 1","No","C4","C4.2",11407,"",null,"Villa Guardia","NO","",2019,"-","-","-","-","-","1 episodio/anno per scolmatore","-",null,null,null,null,null,null,null,null,0,0,0,0,0,0,6968.5,0,6968.5,0]
[null,"206.13245.2","Villa Guardia_SCARICATORI DI PIENA - nuove opere (inserimento / adeguamento paratoie) (LOTTO 1) - Agglomerato 2","No","C4","C4.2",11407,"",null,"Villa Guardia","NO","",2019,"-","-","-","-","-","1 episodio/anno per scolmatore","-",null,null,null,null,null,null,null,null,0,0,0,0,0,0,6968.5,0,6968.5,0]
[null,"206.13245.3","Villa Guardia_SCARICATORI DI PIENA - nuove opere (inserimento / adeguamento paratoie) (LOTTO 1) - Agglomerato 3","No","C4","C4.2",11407,"",null,"Villa Guardia","NO","",2019,"-","-","-","-","-","1 episodio/anno per scolmatore","-",null,null,null,null,null,null,null,null,0,0,0,0,0,0,6968.5,0,6968.5,0]
[null,"403.13246.2","realizzazione opere edili (sfioratore  e fitodepurazione)","No","D2","D2.9",0,"",null,"Zelbio","NO","",2019,"-","-","-","-","-","100% giudizi Conformi / Regolamentari","-",null,null,null,null,null,null,null,null,0,0,0,0,0,0,30000,0,30000,0]
[null,"202.13246.1","Zelbio_RETI FOGNARIE - manutenzione straordinaria (LOTTO 1)","No","C2","C2.1",0,"",null,"Zelbio","NO","",2019,"-","-","-","-","-","-","-",null,null,null,null,null,null,null,null,0,0,0,0,0,0,279.07,0,279.07,0]
[null,"100.13032.A01","Allacciamenti alla rete acquedottistica",null,"-","-",0,"",null,"Brunate",null,"",2016,null,null,"-","-","-","-","-",null,null,null,null,null,null,null,null,0,8000,0,0,0,0,0,0,0,8000]
[null,"100.13065.A01","Allacciamenti alla rete acquedottistica",null,"-","-",0,"",null,"Cernobbio",null,"",2016,null,null,"-","-","-","-","-",null,null,null,null,null,null,null,null,0,15000,0,0,0,0,0,0,0,15000]
[null,"100.13075.A01","Allacciamenti alla rete acquedottistica","No","-","-",0,"",null,"Como",null,"",2016,null,null,"-","-","-","-","-",null,null,null,null,null,null,null,null,0,180000,0,0,0,0,0,0,0,180000]
[null,"100.13032.A02"," POSA CONTATORI",null,"-","-",0,"",null,"Brunate","N.A.","",2016,null,null,"-","-","-","-","-",null,null,null,null,null,null,null,null,0,1500,0,0,0,0,0,0,0,1500]
[null,"100.13065.A02"," POSA CONTATORI",null,"-","-",0,"",null,"Cernobbio","N.A.","",2016,null,null,"-","-","-","-","-",null,null,null,null,null,null,null,null,0,2500,0,0,0,0,0,0,0,2500]
[null,"100.13075.A02"," POSA CONTATORI","No","-","-",0,"",null,"Como","N.A.","",2016,null,null,"-","-","-","-","-",null,null,null,null,null,null,null,null,0,20000,0,0,0,0,0,0,0,20000]
[null,"110.13032.A01","RIFACIMENTO PRESE ",null,"B4","B4.1",10044,"",null,"Brunate",null,"",2016,null,null,"-","-","-","-","-",null,null,null,null,null,null,null,null,20000,0,0,0,0,0,0,0,20000,0]
[null,"110.13065.A01","RIFACIMENTO PRESE ",null,"B4","B4.1",10044,"",null,"Cernobbio",null,"",2016,null,null,"-","-","-","-","-",null,null,null,null,null,null,null,null,20000,0,0,0,0,0,0,0,20000,0]
[null,"110.13075.A01","RIFACIMENTO PRESE ",null,"B4","B4.1",10044,"",null,"Como",null,"",2016,null,null,"-","-","-","-","-",null,null,null,null,null,null,null,null,150000,0,0,0,0,0,0,0,150000,0]
[null,"107.13032.A01","INSERIMENTO RETI ",null,"K1","K1.1",508066,"",null,"Brunate","N.A.","",2016,null,null,100,"-","-","-","-",null,null,null,null,null,null,null,null,4000,0,0,0,0,0,0,0,4000,0]
[null,"107.13065.A01","INSERIMENTO RETI ",null,"K1","K1.1",508066,"",null,"Cernobbio","N.A.","",2016,null,null,100,"-","-","-","-",null,null,null,null,null,null,null,null,3000,0,0,0,0,0,0,0,3000,0]
[null,"107.13075.A01","INSERIMENTO RETI ",null,"K1","K1.1",508066,"",null,"Como","N.A.","",2016,null,null,100,"-","-","-","-",null,null,null,null,null,null,null,null,10000,0,0,0,0,0,0,0,10000,0]
[null,"107.13075.A02","STUDIO IDRICO  RETI E IMPIANTI",null,"K1","K1.1",508066,"",null,"Como","N.A.","",2016,null,null,100,"-","-","-","-",null,null,null,null,null,null,null,null,100000,0,0,0,0,0,0,0,100000,0]
[null,"110.13032.A02","Brunate_INTERVENTI DI MANUTENZIONE STAORDINARIA POZZETTI CONTATORI",null,"B4","B4.1",10044,"",null,"Brunate",null,"",2016,null,null,"-","-","-","-","-",null,null,null,null,null,null,null,null,10000,0,0,0,0,0,0,0,10000,0]
[null,"110.13032.A03","SOST. RETE ACQUA VIA PER CIVIGLIO (SP 37) DN 160 ML. 650",null,"B4","B4.1",10044,"",null,"Brunate",null,"",2016,null,null,"-","-","-","-","-",null,null,null,null,null,null,null,null,150000,0,0,0,0,0,0,0,150000,0]
[null,"110.13065.A02","Cernobbio_INTERVENTI DI MANUTENZIONE STAORDINARIA POZZETTI CONTATORI",null,"B4","B4.1",10044,"",null,"Cernobbio",null,"",2016,null,null,"-","-","-","-","-",null,null,null,null,null,null,null,null,10000,0,0,0,0,0,0,0,10000,0]
[null,"110.13075.A02","SOST. RETE ACQUA V.LE GENO DN 110-125 - ML. 250",null,"B4","B4.1",10044,"",null,"Como",null,"",2016,null,null,"-","-","-","-","-",null,null,null,null,null,null,null,null,150000,0,0,0,0,0,0,0,150000,0]
[null,"110.13075.A03","SOST. RETE ACQUA VIA COLONIOLA DN 110-125 ML. 260",null,"B4","B4.1",10044,"",null,"Como",null,"",2016,null,null,"-","-","-","-","-",null,null,null,null,null,null,null,null,70000,0,0,0,0,0,0,0,70000,0]
[null,"110.13075.A04","SOST. RETE ACQUA VIA CRESPI DN 110 ML. 100",null,"B4","B4.1",10044,"",null,"Como",null,"",2016,null,null,"-","-","-","-","-",null,null,null,null,null,null,null,null,22000,0,0,0,0,0,0,0,22000,0]
[null,"110.13075.A05","SOST. RETE ACQUA VICOLO BONOLA DN 90 ML. 60",null,"B4","B4.1",10044,"",null,"Como",null,"",2016,null,null,"-","-","-","-","-",null,null,null,null,null,null,null,null,25000,0,0,0,0,0,0,0,25000,0]
[null,"110.13075.A06","SOST. RETE ACQUA VIA MOGNANO DN 110 ML 190",null,"B4","B4.1",10044,"",null,"Como",null,"",2016,null,null,"-","-","-","-","-",null,null,null,null,null,null,null,null,46000,0,0,0,0,0,0,0,46000,0]
[null,"110.13075.A07","SOST RETE ACQUA VIA ALBERINA DN 90 ML 110",null,"B4","B4.1",10044,"",null,"Como",null,"",2016,null,null,"-","-","-","-","-",null,null,null,null,null,null,null,null,40000,0,0,0,0,0,0,0,40000,0]
[null,"110.13075.A08","SOST RETE ACQUA VIA COLONIOLA DN 100 ML 280",null,"B4","B4.1",10044,"",null,"Como",null,"",2016,null,null,"-","-","-","-","-",null,null,null,null,null,null,null,null,0,0,0,0,0,0,0,0,0,0]
[null,"110.13075.A09","SOST RETE ACQUA VIA MAURIZIO MONTI DN 100 ML 170",null,"B4","B4.1",10044,"",null,"Como",null,"",2016,null,null,"-","-","-","-","-",null,null,null,null,null,null,null,null,0,0,0,0,0,0,0,0,0,0]
[null,"110.13075.A10","SOST. RETE CANEDA/LUCINO - SOST. ",null,"B4","B4.1",10044,"",null,"Como",null,"",2016,null,null,"-","-","-","-","-",null,null,null,null,null,null,null,null,40000,0,0,0,0,0,0,0,40000,0]
[null,"110.13075.A11","Como_INTERVENTI DI MANUTENZIONE STAORDINARIA POZZETTI CONTATORI",null,"B4","B4.1",10044,"",null,"Como",null,"",2016,null,null,"-","-","-","-","-",null,null,null,null,null,null,null,null,60000,0,0,0,0,0,0,0,{"$f":"SUM(AC1574+AE1574+AG1574+AI1574)","v":60000},{"$f":"SUM(AD1574+AF1574+AH1574+AJ1574)","v":0}]
[null,"110.13075.A12","COLLEG. RETE ACQUA DN 100 IN ATTRAVERSAMENTO",null,"B4","B4.1",10044,"",null,"Como",null,"",2016,null,null,"-","-","-","-","-",null,null,null,null,null,null,null,null,12000,0,0,0,0,0,0,0,12000,0]
[null,"110.13075.A13","RIDUTTORI DI PRESSIONE",null,"B4","B4.1",10044,"",null,"Como","N.A.","",2016,null,null,"-","-","-","-","-",null,null,null,null,null,null,null,null,20000,0,0,0,0,0,0,0,20000,0]
[null,"110.13032.A04","Brunate_INTERVENTI DI MANUTENZIONE  SU SARACINESCHE RETE",null,"B4","B4.1",10044,"",null,"Brunate",null,"",2016,null,null,"-","-","-","-","-",null,null,null,null,null,null,null,null,10000,0,0,0,0,0,0,0,10000,0]
[null,"110.13065.A03","Cernobbio_INTERVENTI DI MANUTENZIONE  SU SARACINESCHE RETE",null,"B4","B4.1",10044,"",null,"Cernobbio",null,"",2016,null,null,"-","-","-","-","-",null,null,null,null,null,null,null,null,20000,0,0,0,0,0,0,0,20000,0]
[null,"110.13075.A14","Como_INTERVENTIDI MANUTENZIONE  SU SARACINESCHE RETE",null,"B4","B4.1",10044,"",null,"Como",null,"",2016,null,null,"-","-","-","-","-",null,null,null,null,null,null,null,null,80000,0,0,0,0,0,0,0,80000,0]
[null,"110.13075.A15","Como_INTERVENTI DI MANUTENZIONE POZZETTI CONTATORI",null,"B4","B4.1",10044,"",null,"Como",null,"",2016,null,null,"-","-","-","-","-",null,null,null,null,null,null,null,null,0,0,0,0,0,0,0,0,0,0]
[null,"110.13075.A16","STRUM. VARIE : MISUR. PORTATA - PEZZI SPECIALI",null,"B4","B4.1",10044,"",null,"Como","N.A.","",2016,null,null,"-","-","-","-","-",null,null,null,null,null,null,null,null,20000,0,0,0,0,0,0,0,20000,0]
[null,"110.13032.A05","Brunate_INTERVENTI DI MANUT. STRAORDINARIA SU RETE",null,"B4","B4.1",10044,"",null,"Brunate",null,"",2016,null,null,"-","-","-","-","-",null,null,null,null,null,null,null,null,40000,0,0,0,0,0,0,0,40000,0]
[null,"110.13065.A04","Cernobbio_INTERVENTI DI MANUT. STRAORDINARIA SU RETE",null,"B4","B4.1",10044,"",null,"Cernobbio",null,"",2016,null,null,"-","-","-","-","-",null,null,null,null,null,null,null,null,100000,0,0,0,0,0,0,0,100000,0]
[null,"110.13075.A17","Como_INTERVENTI DI MANUT. STRAORDINARIA SU RETE","No","B4","B4.1",10044,"",null,"Como",null,"",2016,null,null,"-","-","-","-","-",null,null,null,null,null,null,null,null,450000,0,0,0,0,0,0,0,450000,0]
[null,"110.13032.A06","Brunate_INTERVENTI VARI SU IMPIANTI",null,"B4","B4.1",10044,"",null,"Brunate",null,"",2016,null,null,"-","-","-","-","-",null,null,null,null,null,null,null,null,10000,0,0,0,0,0,0,0,10000,0]
[null,"110.13065.A05","Cernobbio_INTERVENTI VARI SU IMPIANTI",null,"B4","B4.1",10044,"",null,"Cernobbio",null,"",2016,null,null,"-","-","-","-","-",null,null,null,null,null,null,null,null,20000,0,0,0,0,0,0,0,20000,0]
[null,"110.13075.A18","Como_INTERVENTI VARI SU IMPIANTI",null,"B4","B4.1",10044,"",null,"Como",null,"",2016,null,null,"-","-","-","-","-",null,null,null,null,null,null,null,null,30000,0,0,0,0,0,0,0,30000,0]
[null,"110.13075.A19","Via T. Ciceri",null,"B4","B4.1",10044,"",null,"COMO",null,"",2016,null,null,"-","-","-","-","-",null,null,null,null,null,null,null,null,37680,0,0,0,0,0,0,0,37680,0]
[null,"110.13075.A20","Via San Martino",null,"B4","B4.1",10044,"",null,"COMO",null,"",2016,null,null,"-","-","-","-","-",null,null,null,null,null,null,null,null,37680,0,0,0,0,0,0,0,37680,0]
[null,"110.13075.A21","Via Scalabrini",null,"B4","B4.1",10044,"",null,"COMO",null,"",2016,null,null,"-","-","-","-","-",null,null,null,null,null,null,null,null,131880,0,0,0,0,0,0,0,131880,0]
[null,"110.13075.A22","Via Michelangelo Buonarroti",null,"B4","B4.1",10044,"",null,"COMO",null,"",2016,null,null,"-","-","-","-","-",null,null,null,null,null,null,null,null,37680,0,0,0,0,0,0,0,37680,0]
[null,"110.13075.A23","INTERVENTI SU RETI ACQUA IN SEGUITO A STUDIO",null,"B4","B4.1",10044,"",null,"Como",null,"",2016,null,null,"-","-","-","-","-",null,null,null,null,null,null,null,null,300000,0,0,0,0,0,0,0,300000,0]
[null,"108.13075.A01","REWAMPING SISTEMA DI TELECONTROLLO impianti acqua","No","K3","K3.1",0,"",null,"Como","N.A.","",2016,null,null,"-","-","-","-","-",null,null,null,null,null,null,null,null,60000,0,0,0,0,0,0,0,60000,0]
[null,"111.13065.A01","TRATTAMENTO OLIO TRAFO ",null,"B8","B8.1",0,"",null,"Cernobbio",null,"",2016,null,null,"-","-","-","-","-",null,null,null,null,null,null,null,null,12000,0,0,0,0,0,0,0,12000,0]
[null,"111.13065.A02","EFFICENTAMENTO IMPIANTISTICO STAZIONE POMPAGGIO STOMAINO ",null,"B8","B8.1",0,"",null,"Cernobbio",null,"",2016,null,null,"-","-","-","-","-",null,null,null,null,null,null,null,null,30000,0,0,0,0,0,0,0,30000,0]
[null,"111.13065.A03","MODIFICA IDRAULICA GENTRINO",null,"B8","B8.1",0,"",null,"Cernobbio","N.A.","",2016,null,null,"-","-","-","-","-",null,null,null,null,null,null,null,null,12000,0,0,0,0,0,0,0,12000,0]
[null,"111.13065.A04","PRESSURIZZAZIONE RETE GENTRINO",null,"B8","B8.1",0,"",null,"Cernobbio",null,"",2016,null,null,"-","-","-","-","-",null,null,null,null,null,null,null,null,20000,0,0,0,0,0,0,0,20000,0]
[null,"111.13065.A05","INSERIMENTO VALVOLA DI RITEGNO PER SEPARAZIONE RETI",null,"B8","B8.1",0,"",null,"Cernobbio","N.A.","",2016,null,null,"-","-","-","-","-",null,null,null,null,null,null,null,null,2500,0,0,0,0,0,0,0,2500,0]
[null,"111.13065.A06","NUOVO CONTATORE SERBATOI CENTRINO",null,"B8","B8.1",0,"",null,"Cernobbio","N.A.","",2016,null,null,"-","-","-","-","-",null,null,null,null,null,null,null,null,2500,0,0,0,0,0,0,0,2500,0]
[null,"111.13065.A07","SOSTITUZIONE COPERTURA SERBATOI OLIERA",null,"B8","B8.1",0,"",null,"Cernobbio",null,"",2016,null,null,"-","-","-","-","-",null,null,null,null,null,null,null,null,15000,0,0,0,0,0,0,0,15000,0]
[null,"111.13075.A01"," INVERTER SU POMPE DOSS PER EFFICENTAMENTO RETE PRELIO","No","B8","B8.1",0,"",null,"Como","N.A.","",2016,null,null,"-","-","-","-","-",null,null,null,null,null,null,null,null,33000,0,0,0,0,0,0,0,33000,0]
[null,"111.13075.A02","installazione inverter centrale BARADELLO","No","B8","B8.1",0,"",null,"Como","N.A.","",2016,null,null,"-","-","-","-","-",null,null,null,null,null,null,null,null,10000,0,0,0,0,0,0,0,10000,0]
[null,"111.13075.A03"," INVERTER SU POMPE DOSS PER EFFICENTAMENTO RETE REBBIO","No","B8","B8.1",0,"",null,"Como","N.A.","",2016,null,null,"-","-","-","-","-",null,null,null,null,null,null,null,null,33000,0,0,0,0,0,0,0,33000,0]
[null,"111.13075.A04","MANUTENZIONE STRAORDINARIA FABBRICATO DOSS","No","B8","B8.1",0,"",null,"Como",null,"",2016,null,null,"-","-","-","-","-",null,null,null,null,null,null,null,null,170000,0,0,0,0,0,0,0,170000,0]
[null,"111.13075.A05","MODIFICA IDRAULICA BYPAS PRELIO","No","B8","B8.1",0,"",null,"Como","N.A.","",2016,null,null,"-","-","-","-","-",null,null,null,null,null,null,null,null,15000,0,0,0,0,0,0,0,15000,0]
[null,"111.13075.A06","NUOVO CONTATORE USCITA SERBATOIO LORA","No","B8","B8.1",0,"",null,"Como","N.A.","",2016,null,null,"-","-","-","-","-",null,null,null,null,null,null,null,null,5000,0,0,0,0,0,0,0,5000,0]
[null,"111.13075.A07","NUOVO CONTATORE USCITA SERBATOIO PRELIO","No","B8","B8.1",0,"",null,"Como","N.A.","",2016,null,null,"-","-","-","-","-",null,null,null,null,null,null,null,null,5000,0,0,0,0,0,0,0,5000,0]
[null,"111.13075.A08","NUOVO CONTATORE USCITA SERBATOIO MIRABELLO","No","B8","B8.1",0,"",null,"Como","N.A.","",2016,null,null,"-","-","-","-","-",null,null,null,null,null,null,null,null,5000,0,0,0,0,0,0,0,5000,0]
[null,"111.13075.A09","SOST. FILTRO DOSS 1 E TAGLIO PORTA","No","B8","B8.1",0,"",null,"Como","N.A.","",2016,null,null,"-","-","-","-","-",null,null,null,null,null,null,null,null,53000,0,0,0,0,0,0,0,53000,0]
[null,"111.13032.A01","NUOVO CONTATORE USCITA SERBATOIO CAO",null,"B8","B8.1",0,"",null,"Brunate","N.A.","",2016,null,null,"-","-","-","-","-",null,null,null,null,null,null,null,null,2500,0,0,0,0,0,0,0,2500,0]
[null,"105.13075.A01","N° 2 UPS IMPIANTO IN CAVERNA","No","P2","P2.1",0,"",null,"Como","N.A.","",2016,null,null,"100% giudizi almeno DISCRETO","-","-","-","-",null,null,null,null,null,null,null,null,15000,0,0,0,0,0,0,0,15000,0]
[null,"105.13075.A02","installazione inverter centrale BARADELLO","No","P2","P2.1",0,"",null,"Como","N.A.","",2016,null,null,"100% giudizi almeno DISCRETO","-","-","-","-",null,null,null,null,null,null,null,null,10000,0,0,0,0,0,0,0,10000,0]
[null,"105.13075.A03","SOSTITUZIONE SARACINESCHE IMPIANTO DOSS","No","P2","P2.1",0,"",null,"Como","N.A.","",2016,null,null,"100% giudizi almeno DISCRETO","-","-","-","-",null,null,null,null,null,null,null,null,20000,0,0,0,0,0,0,0,20000,0]
[null,"105.13075.A04","UPGRADE SOFTWARE AUTOMAZIONE IMPIANTO CAVERNA","No","P2","P2.1",0,"",null,"Como","N.A.","",2016,null,null,"100% giudizi almeno DISCRETO","-","-","-","-",null,null,null,null,null,null,null,null,25000,0,0,0,0,0,0,0,25000,0]
[null,"111.13075.A10","SOSTITUZIONE RETI AMMALORATE ALL'INTERNO DELL'IMPIANTO DOSS","No","B8","B8.1",0,"",null,"Como","N.A.","",2016,null,null,"-","-","-","-","-",null,null,null,null,null,null,null,null,50000,0,0,0,0,0,0,0,50000,0]
[null,"100.13032.1","Allacciamenti alla rete acquedottistica",null,"-","-",0,"",null,"Brunate",null,"",2017,null,null,"-","-","-","-","-",null,null,null,null,null,null,null,null,0,0,0,8000,0,0,0,0,0,8000]
[null,"100.13065.1","Allacciamenti alla rete acquedottistica",null,"-","-",0,"",null,"Cernobbio",null,"",2017,null,null,"-","-","-","-","-",null,null,null,null,null,null,null,null,0,0,0,15000,0,0,0,0,0,15000]
[null,"100.13075.1","Allacciamenti alla rete acquedottistica","No","-","-",0,"",null,"Como",null,"",2017,null,null,"-","-","-","-","-",null,null,null,null,null,null,null,null,0,0,0,180000,0,0,0,0,0,180000]
[null,"100.13032.2"," POSA CONTATORI",null,"-","-",0,"",null,"Brunate","N.A.","",2017,null,null,"-","-","-","-","-",null,null,null,null,null,null,null,null,0,0,0,1500,0,0,0,0,0,1500]
[null,"100.13065.2"," POSA CONTATORI",null,"-","-",0,"",null,"Cernobbio","N.A.","",2017,null,null,"-","-","-","-","-",null,null,null,null,null,null,null,null,0,0,0,2500,0,0,0,0,0,2500]
[null,"100.13075.2"," POSA CONTATORI","No","-","-",0,"",null,"Como","N.A.","",2017,null,null,"-","-","-","-","-",null,null,null,null,null,null,null,null,0,0,0,20000,0,0,0,0,0,20000]
[null,"107.13032.1","STUDIO IDRICO  RETI E IMPIANTI",null,"K1","K1.1",508066,"",null,"Brunate","N.A.","",2017,null,null,"-",100,"-","-","-",null,null,null,null,null,null,null,null,0,0,10000,0,0,0,0,0,10000,0]
[null,"107.13065.1","STUDIO IDRICO  RETI E IMPIANTI",null,"K1","K1.1",508066,"",null,"Cernobbio","N.A.","",2017,null,null,"-",100,"-","-","-",null,null,null,null,null,null,null,null,0,0,15000,0,0,0,0,0,15000,0]
[null,"107.13075.1","STUDIO IDRICO  RETI E IMPIANTI",null,"K1","K1.1",508066,"",null,"Como","N.A.","",2017,null,null,"-",100,"-","-","-",null,null,null,null,null,null,null,null,0,0,100000,0,0,0,0,0,100000,0]
[null,"110.13032.1","Brunate_INTERVENTI DI MANUT. STRAORDINARIA SU RETE",null,"B4","B4.1",10044,"",null,"Brunate",null,"",2017,null,null,"-","-","-","-","-",null,null,null,null,null,null,null,null,0,0,40000,0,0,0,0,0,40000,0]
[null,"110.13065.1","Cernobbio_INTERVENTI DI MANUT. STRAORDINARIA SU RETE",null,"B4","B4.1",10044,"",null,"Cernobbio",null,"",2017,null,null,"-","-","-","-","-",null,null,null,null,null,null,null,null,0,0,100000,0,0,0,0,0,100000,0]
[null,"110.13032.2","Brunate_INTERVENTI VARI SU IMPIANTI",null,"B4","B4.1",10044,"",null,"Brunate",null,"",2017,null,null,"-","-","-","-","-",null,null,null,null,null,null,null,null,0,0,10000,0,0,0,0,0,10000,0]
[null,"110.13065.2","Cernobbio_INTERVENTI VARI SU IMPIANTI",null,"B4","B4.1",10044,"",null,"Cernobbio",null,"",2017,null,null,"-","-","-","-","-",null,null,null,null,null,null,null,null,0,0,10000,0,0,0,0,0,10000,0]
[null,"110.13075.1","RIDUTTORI DI PRESSIONE",null,"B4","B4.1",10044,"",null,"Como","N.A.","",2017,null,null,"-","-","-","-","-",null,null,null,null,null,null,null,null,0,0,20000,0,0,0,0,0,20000,0]
[null,"110.13075.2","Como_INTERVENTI VARI SU IMPIANTI",null,"B4","B4.1",10044,"",null,"Como",null,"",2017,null,null,"-","-","-","-","-",null,null,null,null,null,null,null,null,0,0,50000,0,0,0,0,0,50000,0]
[null,"110.13075.3","Via Pio XI, 96 a Via al Roccolo",null,"B4","B4.1",10044,"",null,"COMO",null,"",2017,null,null,"-","-","-","-","-",null,null,null,null,null,null,null,null,0,0,61230,0,0,0,0,0,61230,0]
[null,"110.13075.4","Via Palestro",null,"B4","B4.1",10044,"",null,"COMO",null,"",2017,null,null,"-","-","-","-","-",null,null,null,null,null,null,null,null,0,0,24806,0,0,0,0,0,24806,0]
[null,"110.13075.5","Via Buschi",null,"B4","B4.1",10044,"",null,"COMO",null,"",2017,null,null,"-","-","-","-","-",null,null,null,null,null,null,null,null,0,0,75360,0,0,0,0,0,75360,0]
[null,"110.13075.6","Via del Lavoro",null,"B4","B4.1",10044,"",null,"COMO",null,"",2017,null,null,"-","-","-","-","-",null,null,null,null,null,null,null,null,0,0,18055,0,0,0,0,0,18055,0]
[null,"111.13075.1","SOSTITUZIONE RETI AMMALORATE ALL'INTERNO DELL'IMPIANTO DOSS","No","B8","B8.1",0,"",null,"Como","N.A.","",2017,null,null,"-","-","-","-","-",null,null,null,null,null,null,null,null,0,0,50000,0,0,0,0,0,50000,0]
[null,"110.13032.3","Brunate_INTERVENTI DI MANUTENZIONE STAORDINARIA POZZETTI CONTATORI",null,"B4","B4.1",10044,"",null,"Brunate",null,"",2017,null,null,"-","-","-","-","-",null,null,null,null,null,null,null,null,0,0,10000,0,0,0,0,0,10000,0]
[null,"110.13065.3","Cernobbio_INTERVENTI DI MANUTENZIONE STAORDINARIA POZZETTI CONTATORI",null,"B4","B4.1",10044,"",null,"Cernobbio",null,"",2017,null,null,"-","-","-","-","-",null,null,null,null,null,null,null,null,0,0,10000,0,0,0,0,0,10000,0]
[null,"100.13032.3","Allacciamenti alla rete acquedottistica",null,"-","-",0,"",null,"Brunate",null,"",2018,null,null,"-","-","-","-","-",null,null,null,null,null,null,null,null,0,0,0,0,0,8000,0,0,{"$f":"SUM(AC1638+AE1638+AG1638+AI1638)","v":0},{"$f":"SUM(AD1638+AF1638+AH1638+AJ1638)","v":8000}]
[null,"100.13065.3","Allacciamenti alla rete acquedottistica",null,"-","-",0,"",null,"Cernobbio",null,"",2018,null,null,"-","-","-","-","-",null,null,null,null,null,null,null,null,0,0,0,0,0,15000,0,0,0,15000]
[null,"100.13075.3","Allacciamenti alla rete acquedottistica","No","-","-",0,"",null,"Como",null,"",2018,null,null,"-","-","-","-","-",null,null,null,null,null,null,null,null,0,0,0,0,0,180000,0,0,0,180000]
[null,"100.13032.4"," POSA CONTATORI",null,"-","-",0,"",null,"Brunate","N.A.","",2018,null,null,"-","-","-","-","-",null,null,null,null,null,null,null,null,0,0,0,0,0,1500,0,0,0,1500]
[null,"100.13065.4"," POSA CONTATORI",null,"-","-",0,"",null,"Cernobbio","N.A.","",2018,null,null,"-","-","-","-","-",null,null,null,null,null,null,null,null,0,0,0,0,0,2500,0,0,0,2500]
[null,"100.13075.4"," POSA CONTATORI","No","-","-",0,"",null,"Como","N.A.","",2018,null,null,"-","-","-","-","-",null,null,null,null,null,null,null,null,0,0,0,0,0,25000,0,0,0,25000]
[null,"107.13032.2","STUDIO IDRICO  RETI E IMPIANTI",null,"K1","K1.1",508066,"",null,"Brunate","N.A.","",2018,null,null,"-","-",100,"-","-",null,null,null,null,null,null,null,null,0,0,0,0,5000,0,0,0,5000,0]
[null,"107.13065.2","STUDIO IDRICO  RETI E IMPIANTI",null,"K1","K1.1",508066,"",null,"Cernobbio","N.A.","",2018,null,null,"-","-",100,"-","-",null,null,null,null,null,null,null,null,0,0,0,0,5000,0,0,0,5000,0]
[null,"107.13075.2","STUDIO IDRICO  RETI E IMPIANTI",null,"K1","K1.1",508066,"",null,"Como","N.A.","",2018,null,null,"-","-",100,"-","-",null,null,null,null,null,null,null,null,0,0,0,0,80000,0,0,0,80000,0]
[null,"110.13075.7","Via Museo Giovio",null,"B4","B4.1",10044,"",null,"COMO",null,"",2018,null,null,"-","-","-","-","-",null,null,null,null,null,null,null,null,0,0,0,0,67510,0,0,0,67510,0]
[null,"110.13075.8","Via Acquanera",null,"B4","B4.1",10044,"",null,"COMO",null,"",2018,null,null,"-","-","-","-","-",null,null,null,null,null,null,null,null,0,0,0,0,157785,0,0,0,157785,0]
[null,"110.13075.9","Como_INTERVENTI VARI SU IMPIANTI",null,"B4","B4.1",10044,"",null,"Como",null,"",2018,null,null,"-","-","-","-","-",null,null,null,null,null,null,null,null,0,0,0,0,30000,0,0,0,30000,0]
[null,"110.13075.10","RIDUTTORI DI PRESSIONE",null,"B4","B4.1",10044,"",null,"Como","N.A.","",2018,null,null,"-","-","-","-","-",null,null,null,null,null,null,null,null,0,0,0,0,20000,0,0,0,20000,0]
[null,"110.13032.4","Brunate_INTERVENTI DI MANUT. STRAORDINARIA SU RETE",null,"B4","B4.1",10044,"",null,"Brunate",null,"",2018,null,null,"-","-","-","-","-",null,null,null,null,null,null,null,null,0,0,0,0,40000,0,0,0,40000,0]
[null,"110.13065.4","Cernobbio_INTERVENTI DI MANUT. STRAORDINARIA SU RETE",null,"B4","B4.1",10044,"",null,"Cernobbio",null,"",2018,null,null,"-","-","-","-","-",null,null,null,null,null,null,null,null,0,0,0,0,70000,0,0,0,70000,0]
[null,"110.13032.5","Brunate_INTERVENTI VARI SU IMPIANTI",null,"B4","B4.1",10044,"",null,"Brunate",null,"",2018,null,null,"-","-","-","-","-",null,null,null,null,null,null,null,null,0,0,0,0,15000,0,0,0,15000,0]
[null,"110.13065.5","Cernobbio_INTERVENTI VARI SU IMPIANTI",null,"B4","B4.1",10044,"",null,"Cernobbio",null,"",2018,null,null,"-","-","-","-","-",null,null,null,null,null,null,null,null,0,0,0,0,10000,0,0,0,10000,0]
[null,"111.13075.2","SOSTITUZIONE RETI AMMALORATE ALL'INTERNO DELL'IMPIANTO DOSS","No","B8","B8.1",0,"",null,"Como","N.A.","",2018,null,null,"-","-","-","-","-",null,null,null,null,null,null,null,null,0,0,0,0,50000,0,0,0,50000,0]
[null,"110.13032.6","Brunate_INTERVENTI DI MANUTENZIONE STAORDINARIA POZZETTI CONTATORI",null,"B4","B4.1",10044,"",null,"Brunate",null,"",2018,null,null,"-","-","-","-","-",null,null,null,null,null,null,null,null,0,0,0,0,5000,0,0,0,5000,0]
[null,"110.13065.6","Cernobbio_INTERVENTI DI MANUTENZIONE STAORDINARIA POZZETTI CONTATORI",null,"B4","B4.1",10044,"",null,"Cernobbio",null,"",2018,null,null,"-","-","-","-","-",null,null,null,null,null,null,null,null,0,0,0,0,10000,0,0,0,10000,0]
[null,"100.13032.5","Allacciamenti alla rete acquedottistica",null,"-","-",0,"",null,"Brunate",null,"",2019,null,null,"-","-","-","-","-",null,null,null,null,null,null,null,null,0,0,0,0,0,0,0,8000,0,8000]
[null,"100.13065.5","Allacciamenti alla rete acquedottistica",null,"-","-",0,"",null,"Cernobbio",null,"",2019,null,null,"-","-","-","-","-",null,null,null,null,null,null,null,null,0,0,0,0,0,0,0,15000,0,15000]
[null,"100.13075.5","Allacciamenti alla rete acquedottistica","No","-","-",0,"",null,"Como",null,"",2019,null,null,"-","-","-","-","-",null,null,null,null,null,null,null,null,0,0,0,0,0,0,0,160000,0,160000]
[null,"100.13032.6"," POSA CONTATORI",null,"-","-",0,"",null,"Brunate","N.A.","",2019,null,null,"-","-","-","-","-",null,null,null,null,null,null,null,null,0,0,0,0,0,0,0,1500,0,1500]
[null,"100.13065.6"," POSA CONTATORI",null,"-","-",0,"",null,"Cernobbio","N.A.","",2019,null,null,"-","-","-","-","-",null,null,null,null,null,null,null,null,0,0,0,0,0,0,0,2000,0,2000]
[null,"100.13075.6"," POSA CONTATORI","No","-","-",0,"",null,"Como","N.A.","",2019,null,null,"-","-","-","-","-",null,null,null,null,null,null,null,null,0,0,0,0,0,0,0,25000,0,25000]
[null,"107.13032.3","STUDIO IDRICO  RETI E IMPIANTI",null,"K1","K1.1",508066,"",null,"Brunate","N.A.","",2019,null,null,"-","-","-",100,"-",null,null,null,null,null,null,null,null,0,0,0,0,0,0,5000,0,5000,0]
[null,"107.13075.3","STUDIO IDRICO  RETI E IMPIANTI",null,"K1","K1.1",508066,"",null,"Como","N.A.","",2019,null,null,"-","-","-",100,"-",null,null,null,null,null,null,null,null,0,0,0,0,0,0,50000,0,50000,0]
[null,"110.13032.7","Brunate_INTERVENTI DI MANUT. STRAORDINARIA SU RETE",null,"B4","B4.1",10044,"",null,"Brunate",null,"",2019,null,null,"-","-","-","-","-",null,null,null,null,null,null,null,null,0,0,0,0,0,0,50000,0,50000,0]
[null,"110.13065.7","Cernobbio_INTERVENTI DI MANUT. STRAORDINARIA SU RETE",null,"B4","B4.1",10044,"",null,"Cernobbio",null,"",2019,null,null,"-","-","-","-","-",null,null,null,null,null,null,null,null,0,0,0,0,0,0,80000,0,80000,0]
[null,"110.13032.8","Brunate_INTERVENTI VARI SU IMPIANTI",null,"B4","B4.1",10044,"",null,"Brunate",null,"",2019,null,null,"-","-","-","-","-",null,null,null,null,null,null,null,null,0,0,0,0,0,0,5000,0,5000,0]
[null,"110.13065.8","Cernobbio_INTERVENTI VARI SU IMPIANTI",null,"B4","B4.1",10044,"",null,"Cernobbio",null,"",2019,null,null,"-","-","-","-","-",null,null,null,null,null,null,null,null,0,0,0,0,0,0,10000,0,10000,0]
[null,"110.13075.11","Como_RETE DI DISTRIBUZIONE - manutenzione straordinaria / rifacimenti (LOTTO 1)",null,"B4","B4.1",10044,"",null,"Como",null,"",2019,null,null,"-","-","-","-","-",null,null,null,null,null,null,null,null,0,0,0,0,0,0,100000,0,100000,0]
[null,"110.13075.12","RIDUTTORI DI PRESSIONE",null,"B4","B4.1",10044,"",null,"Como","N.A.","",2019,null,null,"-","-","-","-","-",null,null,null,null,null,null,null,null,0,0,0,0,0,0,20000,0,20000,0]
[null,"110.13075.13","Como_INTERVENTI VARI SU IMPIANTI",null,"B4","B4.1",10044,"",null,"Como",null,"",2019,null,null,"-","-","-","-","-",null,null,null,null,null,null,null,null,0,0,0,0,0,0,50000,0,50000,0]
[null,"111.13065.1","INTERVENTO SU FABBRICATO SERBATOIO STOMAINO",null,"B8","B8.1",0,"",null,"Cernobbio",null,"",2019,null,null,"-","-","-","-","-",null,null,null,null,null,null,null,null,0,0,0,0,0,0,6000,0,6000,0]
[null,"111.13075.3","SOSTITUZIONE RETI AMMALORATE ALL'INTERNO DELL'IMPIANTO DOSS","No","B8","B8.1",0,"",null,"Como","N.A.","",2019,null,null,"-","-","-","-","-",null,null,null,null,null,null,null,null,0,0,0,0,0,0,50000,0,50000,0]
[null,"110.13032.9","Brunate_INTERVENTI DI MANUTENZIONE STAORDINARIA POZZETTI CONTATORI",null,"B4","B4.1",10044,"",null,"Brunate",null,"",2019,null,null,"-","-","-","-","-",null,null,null,null,null,null,null,null,0,0,0,0,0,0,5000,0,5000,0]
[null,"110.13065.9","Cernobbio_INTERVENTI DI MANUTENZIONE STAORDINARIA POZZETTI CONTATORI",null,"B4","B4.1",10044,"",null,"Cernobbio",null,"",2019,null,null,"-","-","-","-","-",null,null,null,null,null,null,null,null,0,0,0,0,0,0,10000,0,10000,0]
[null,"110.13065.10","Via Trieste",null,"B4","B4.1",10044,"",null,"Cernobbio",null,"",2018,null,null,"-","-","-","-","-",null,null,null,null,null,null,null,null,0,0,0,0,81012,0,0,0,81012,0]
[null,"105.13075.1","SOSTITUZIONE POMICE IMPIANTO FILTRAZIONE CAVERNA","No","P2","P2.1",0,"",null,"Como","N.A.","",2017,null,null,"-","100% giudizi almeno DISCRETO","-","-","-",null,null,null,null,null,null,null,null,0,0,180000,0,0,0,0,0,180000,0]
[null,"105.13075.2","COMPRESSORI ARIA CAVERNA","No","P2","P2.1",0,"",null,"Como","N.A.","",2017,null,null,"-","100% giudizi almeno DISCRETO","-","-","-",null,null,null,null,null,null,null,null,0,0,10000,0,0,0,0,0,10000,0]